program: Gaussian 09
title: 000196628
version: EM64L-G09RevD.01
frameworkgroup: C1[X(C12H20O12)]
method: RPBEPBE
basis: SDD
operation: Freq
keyword: #p
keyword: freq=noraman
keyword: PBEPBE/SDD
title: #p freq=noraman PBEPBE/SDD
converged: YES YES NO NO
title: Mulliken charges:
elementType: O O O O O O O O O O O O C C C C C C C C C C C C H H H H H H H H H H H H H H H H H H H H
charge: -0.243607 -0.351436 -0.458993 -0.447603 -0.500868 -0.437065 -0.459502 -0.467744 -0.463650 -0.189624 -0.485917 -0.225474 -0.214154 -0.129900 -0.141698 -0.006123 -0.106316 -0.210992 -0.234469 -0.138454 -0.143466 0.174532 -0.120469 -0.098563 0.326229 0.247126 0.232068 0.243065 0.294658 0.234087 0.228659 0.223050 0.259850 0.259344 0.368394 0.367718 0.390490 0.259049 0.375307 0.355184 0.365437 0.401955 0.239988 0.429897
chargesum: 0.00000
title: Mulliken charges with hydrogens summed into heavy atoms:
elementType: O O O O O O O O O O O O C C C C C C C C C C C C
charge: -0.243607 -0.351436 -0.090599 -0.079885 -0.110378 -0.061759 -0.104318 -0.102307 -0.061695 -0.189624 -0.056020 -0.225474 0.112075 0.117225 0.090370 0.236943 0.188342 0.023095 0.217241 0.121396 0.115878 0.174532 0.138579 0.141425
polarizability: 1.99075335e+02 -2.45546204e+00 1.62497806e+02 4.74932683e+00 3.06977862e-01 1.44758766e+02
1716.lowfreq: -7.1126 -5.2524 -3.7920 -0.0003 0.0005 0.0006 17.0300 20.6274 26.8789
frequency: 16.9581 20.4171 26.8101 48.5920 55.1545 77.5742 82.6934 98.3528 108.6878 120.1122 142.1253 153.8139 156.9402 191.7013 205.1480 219.4963 228.2582 234.3650 256.2985 262.1587 284.1996 293.0741 302.6974 308.1615 312.5476 339.9810 355.8766 362.0132 390.5220 400.4778 405.3090 442.2461 479.1050 486.0344 498.6720 538.8151 556.9082 558.8546 563.5869 577.2735 591.3327 615.7565 661.0750 669.0295 686.3088 689.0973 700.1899 708.5997 748.4582 786.3076 807.0692 827.6682 834.6082 862.0346 875.0688 878.7154 917.6493 925.8529 933.0092 943.2772 973.4637 984.0310 999.9987 1005.1318 1020.1416 1036.2553 1055.3273 1069.0694 1077.6729 1083.8391 1091.9824 1099.5652 1111.8067 1125.8032 1173.9244 1194.8685 1210.2586 1227.8403 1234.6805 1248.1513 1254.5023 1265.6557 1266.8938 1275.4575 1278.7456 1286.2442 1296.0235 1296.9068 1308.1803 1314.9190 1324.0379 1335.6566 1342.7044 1348.5512 1360.4635 1369.7311 1373.7291 1380.9241 1388.9181 1392.5945 1396.0406 1401.8749 1425.3628 1462.3048 1629.1110 1687.8045 2972.3637 2975.5189 2977.9788 2978.1939 2980.6757 2995.2158 3002.8486 3020.6415 3037.6263 3043.5340 3053.7682 3099.7482 3147.5900 3253.8174 3478.4998 3480.6573 3505.5293 3516.9899 3525.0118 3531.2661
redmass: 7.4103 6.9755 8.6864 5.9979 5.7218 7.2287 7.6195 9.6965 5.4196 5.2947 6.8557 6.0484 6.5310 6.3914 5.1338 6.2602 5.1356 6.2033 5.5940 5.1146 7.3774 5.8740 5.9019 3.6027 5.3990 5.1688 4.2257 7.9322 1.1062 5.5640 4.3160 1.1518 3.7708 3.9648 1.2270 3.7534 1.2702 2.6745 2.8726 2.7737 1.1956 2.2185 3.5395 3.0598 2.9070 2.9560 3.2277 2.1388 4.0533 3.7869 4.4623 2.2769 2.1471 4.5498 2.7860 2.6086 4.1308 3.7216 3.5864 2.8633 3.2523 3.2448 6.8249 2.7578 3.5840 5.3530 3.2074 2.4260 4.0869 2.7020 3.4318 2.2486 2.2950 2.4247 1.2111 1.2815 1.1916 1.1671 1.1831 1.2171 1.2434 1.6955 1.3773 1.2838 1.3709 1.2644 1.2727 1.2816 1.3221 1.2615 1.2929 1.2570 1.2970 1.1927 1.2184 1.3902 1.2764 1.6284 1.2890 1.3823 1.4425 1.5421 1.1374 1.0802 8.3925 9.4152 1.0834 1.0828 1.0704 1.0747 1.0846 1.0845 1.0820 1.0831 1.0875 1.1047 1.0896 1.0870 1.0698 1.0667 1.0644 1.0646 1.0658 1.0639 1.0658 1.0653
irintensity: 3.2246 0.6905 2.2914 0.8779 0.5890 2.4290 0.9222 0.6572 10.9164 5.9941 14.5210 1.7052 1.5629 3.9137 11.1958 8.3862 1.1939 1.8079 6.8510 3.8349 2.3638 17.0600 3.0896 6.1224 22.2987 0.5742 3.7997 4.0649 54.9646 4.0798 3.1465 75.2077 19.3825 16.5857 113.5075 10.2215 87.9090 158.3259 8.1024 131.2607 115.1894 126.8825 13.9271 7.4680 3.3650 6.0759 84.8626 23.2778 110.1311 33.4569 18.8951 67.9809 227.6197 6.3988 43.0906 35.0481 67.2695 174.4670 306.8624 11.8917 87.5111 6.1094 82.3131 11.7783 62.6010 106.8756 6.4706 47.0968 81.0093 18.1000 159.9963 42.6299 6.1196 75.3720 32.7803 42.2592 37.3860 23.4718 15.2080 7.2986 31.5807 49.1925 27.5443 7.2933 86.1161 5.4363 2.6758 6.0053 42.2831 11.5106 25.3988 16.2004 4.6866 38.7825 25.3687 1.8723 7.8128 15.9426 51.2407 40.3780 5.1330 16.4602 60.2390 12.4202 151.9463 196.5167 11.7234 25.9824 38.8769 21.6922 32.0070 58.3864 36.7632 10.8654 36.3008 9.8447 23.9114 0.8804 467.2102 271.6480 37.8627 38.5890 130.9711 18.3563 13.9341 22.2384
temp: 298.150 k
press: 1.00000 atm
elementType: 8 8 8 8 8 8 8 8 8 8 8 8 6 6 6 6 6 6 6 6 6 6 6 6 1 1 1 1 1 1 1 1 1 1 1 1 1 1 1 1 1 1 1 1
symmnumber: 1
zpe: 884565.2 jmol-1
zpe.correction: 0.336913 hartree
zpe.thermalcorrener: 0.361908 hartree
zpe.thermalcorrenthalpy: 0.362853 hartree
zpe.thermalcorrgfe: 0.281013 hartree
zpe.sumelectzpe: -1369.972822 hartree
zpe.sumelectthermal: -1369.947827 hartree
zpe.sumelectthermalent: -1369.946883 hartree
zpe.sumelectthermalfe: -1370.028722 hartree
dipole: 1.7559 3.0810 -0.2971
dipole: 3.5587
quadrupole: -120.2971 -152.0470 -142.7978
quadrupole: 6.8359 0.8182 -0.5833
quadrupole: 18.0835 -13.6663 -4.4172 6.8359 0.8182 -0.5833
hfenergy: -1370.3097355 hartree
pointgroup: C01 [X(C12H20O12)]
dipole: 0.6652237 0.9436248 -0.7920149 debye
polarizability: 189.0327753|14.3807934|158.2556898|16.3414459|-3.7560302|159.0434424 unknown
InChI: InChI=1S/C12H20O12/c13-1-3(14)5(16)6(17)4(15)2-23-12-9(20)7(18)8(19)10(24-12)11(21)22/h1,3-10,12,14-21H,2H2
charge 0 multiplicity 1
44 atoms
O  2.223892 0.10317 -0.907543
O  0.121736 -0.987389 -0.463777
O  2.342228 -0.274831 3.31966
O  1.251965 -2.417489 1.651434
O  3.848038 1.008449 1.490882
O  -2.235898 -2.779558 -1.167165
O  -3.866778 -0.2741 -2.673769
O  -4.637059 0.640331 -0.251492
O  3.767313 2.878271 -0.473791
O  1.973029 2.991703 -1.941099
O  -1.888735 -1.384618 1.207581
O  -1.043073 1.355628 1.327207
C  1.760773 -0.022124 1.995819
C  1.985499 -1.27518 1.121264
C  2.403874 1.219084 1.345306
C  1.570963 -1.082939 -0.347139
C  1.914727 1.327623 -0.117163
C  -1.874889 -1.563596 -1.888046
C  -0.366245 -1.250948 -1.838475
C  -2.840101 -0.367098 -1.593769
C  -3.652774 -0.448317 -0.272038
C  2.504458 2.463436 -0.950315
C  -2.84088 -0.303756 1.049971
C  -2.263845 1.103829 1.171235
H  0.686346 0.148341 2.158002
H  3.078773 -1.471164 1.103788
H  2.085904 2.131575 1.891365
H  1.938605 -1.912707 -0.978049
H  0.817273 1.472384 -0.088561
H  -2.041951 -1.811983 -2.955369
H  -0.132866 -0.376896 -2.477783
H  0.169743 -2.139843 -2.22513
H  -2.315707 0.602043 -1.665479
H  -4.162347 -1.434227 -0.247805
H  3.314893 -0.073136 3.23558
H  1.417493 -2.43445 2.630883
H  4.317558 1.712265 0.969723
H  -3.582524 -0.399584 1.869332
H  -2.110123 -2.604634 -0.181589
H  -4.252237 -1.179645 -2.813373
H  -4.995193 0.702604 -1.179223
H  4.126741 3.603866 -1.052499
H  -3.023545 1.912399 1.100881
H  -0.979353 -1.148191 0.825833
