program: Gaussian 09
title: 000196643
version: EM64L-G09RevD.01
frameworkgroup: C1[X(C13H24N4O7)]
method: RPBEPBE
basis: SDD
operation: Freq
keyword: #p
keyword: freq=noraman
keyword: PBEPBE/SDD
title: #p freq=noraman PBEPBE/SDD
converged: YES YES NO NO
title: Mulliken charges:
elementType: O O O O O O O N N N N C C C C C C C C C C C C C H H H H H H H H H H H H H H H H H H H H H H H H
charge: -0.251324 -0.391524 -0.436714 -0.405133 -0.219879 -0.435194 -0.258635 -0.340942 -0.387147 -0.570997 -0.664007 -0.215410 -0.437372 -0.348765 -0.358323 0.220153 -0.140833 -0.395863 0.289727 -0.233213 -0.503552 -0.366521 0.168539 0.204991 0.256847 0.237005 0.216327 0.193128 0.199134 0.221063 0.186758 0.376672 0.312863 0.339557 0.178611 0.207331 0.261503 0.248312 0.267211 0.230798 0.232918 0.274138 0.260317 0.308944 0.315117 0.346411 0.388511 0.418462
chargesum: 0.00000
title: Mulliken charges with hydrogens summed into heavy atoms:
elementType: O O O O O O O N N N N C C C C C C C C C C C C C
charge: -0.251324 -0.391524 -0.090303 -0.016622 -0.219879 -0.016732 -0.258635 0.035730 -0.047591 -0.036542 -0.039946 0.041437 0.015959 0.043497 0.049499 0.220153 0.172029 -0.009921 0.289727 0.028289 0.011972 0.097195 0.168539 0.204991
polarizability: 2.19764359e+02 7.97082116e+00 1.98102731e+02 1.94422500e+00 -1.52578490e+00 1.61570042e+02
1716.lowfreq: -6.7613 -4.7221 -0.0002 0.0005 0.0009 5.6091 16.6992 23.7061 26.5056
frequency: 16.6466 23.5119 26.4505 28.6612 33.1166 44.3564 47.3328 54.0178 75.9788 80.2522 88.0705 112.0834 120.5938 129.1425 131.9912 144.0182 153.7238 167.5444 179.4608 209.1227 216.4372 243.5102 256.6015 272.2731 281.2091 297.6979 309.5991 336.7879 345.3184 369.8933 397.5765 412.1683 418.6213 432.8585 447.0671 489.8825 540.8891 548.1212 569.9163 575.6879 602.1101 609.5752 620.5684 635.0591 680.1046 703.7175 709.0717 726.2609 737.9042 752.1029 781.8099 811.6822 828.1627 847.6090 868.4864 882.5808 891.6473 911.3037 918.1141 930.1524 944.3091 950.3166 965.4597 995.1620 1002.3518 1014.9957 1033.6849 1059.8005 1079.0157 1093.6920 1097.7994 1099.4155 1111.6472 1118.6004 1133.0032 1139.7503 1163.2269 1206.4079 1209.6837 1215.4844 1223.6274 1245.5199 1262.6095 1264.3221 1277.8527 1280.5128 1284.5189 1291.8218 1297.0101 1307.6127 1315.5316 1322.4070 1334.3316 1339.4852 1341.9689 1349.2539 1362.2583 1371.9785 1389.1842 1390.2909 1453.9745 1461.7774 1463.3168 1465.0240 1479.3151 1492.5613 1493.5649 1496.9104 1592.5224 1624.2569 1633.9225 1639.1977 1648.4205 1661.0816 2817.3547 2860.5880 2958.5106 2961.0581 2965.9756 2988.2962 3005.2203 3008.0592 3009.4933 3020.7918 3041.8286 3044.6304 3048.6256 3056.4684 3091.9847 3125.8792 3293.5416 3437.7130 3453.4037 3512.9540 3531.6150 3556.0231 3562.6116 3580.9832
redmass: 7.2321 5.9769 6.7396 6.2678 4.9853 6.1154 3.3531 2.2880 6.6852 4.8743 3.4841 4.4467 5.8163 4.4248 1.9423 4.4575 4.6895 3.3855 4.5609 5.0527 5.6128 1.2752 6.2788 4.6700 5.5277 4.2524 4.7620 1.9912 2.0217 2.9657 2.0445 4.0844 2.5228 3.0094 1.7662 3.4031 4.0046 2.8261 3.5401 2.8447 1.3016 1.7168 1.5337 3.8474 4.7873 5.9471 4.6772 4.0294 1.1614 4.5944 1.2545 1.5273 2.7875 2.0786 1.6665 1.9251 2.1760 1.2726 2.9012 2.7686 2.3990 2.3788 2.3851 2.5904 3.1328 2.2569 2.9462 2.6743 2.7302 2.2180 2.3238 2.1961 1.5203 2.2356 2.0392 1.8012 2.1933 1.5994 1.8388 1.4277 1.7210 1.4683 1.3166 1.3146 1.2937 1.4017 1.0655 1.1906 1.3180 1.2582 2.2065 1.3445 1.4008 1.3071 1.3873 1.5251 1.6452 1.1911 1.5163 1.4671 1.1134 1.0931 1.1222 1.0714 1.1428 1.5316 1.2494 1.8369 6.7628 5.7849 5.0579 1.0941 1.1645 9.0810 1.0727 1.0716 1.0626 1.0836 1.0617 1.0603 1.0919 1.0611 1.0907 1.0869 1.1003 1.0692 1.0742 1.1022 1.1048 1.1054 1.0766 1.0459 1.0449 1.0641 1.0780 1.0967 1.0666 1.0975
irintensity: 1.8876 0.2319 0.5075 3.4580 0.3496 1.4447 2.3963 5.4480 1.1829 1.8860 1.0968 14.2011 0.6159 6.1883 1.0114 0.2294 0.3624 6.7360 0.9336 3.5431 3.4924 64.2757 50.8590 7.4986 3.9298 12.8777 20.4008 80.4667 40.9929 8.1314 8.7172 1.1779 39.4723 55.6325 68.8595 10.2753 44.4123 17.0414 0.8335 4.5530 241.8130 110.4161 168.7406 14.0942 31.6675 1.6489 23.8017 24.9705 21.0697 7.7626 12.7630 72.9631 163.6694 124.3060 33.4463 137.9561 5.5909 75.8213 13.8098 47.4617 10.7338 34.3225 31.4544 73.9176 7.8700 9.9062 2.3905 8.2603 115.9497 18.2542 83.5776 24.6911 50.7326 28.2250 0.6430 51.9744 33.5504 11.5462 82.5902 20.4188 74.6283 21.2038 5.1167 14.8707 7.9662 3.2411 0.4074 5.7200 48.2324 3.9388 42.3917 12.3439 8.5485 19.5424 13.8613 10.3672 1.0916 32.9267 95.9270 8.6868 34.5093 13.2031 22.8625 1.1711 46.0968 149.9794 47.3254 169.4492 226.7873 127.1673 355.5369 39.1796 18.2956 268.9098 947.4410 113.3855 1.1994 24.0482 45.9357 26.6966 18.0177 27.7113 18.3132 7.5392 14.4490 19.7264 2.0230 95.9657 18.9266 2.6351 155.8873 5.2348 1.3952 32.9699 34.9818 19.2653 10.5759 0.2359
temp: 298.150 k
press: 1.00000 atm
elementType: 8 8 8 8 8 8 8 7 7 7 7 6 6 6 6 6 6 6 6 6 6 6 6 6 1 1 1 1 1 1 1 1 1 1 1 1 1 1 1 1 1 1 1 1 1 1 1 1
symmnumber: 1
zpe: 1019825.9 jmol-1
zpe.correction: 0.388431 hartree
zpe.thermalcorrener: 0.415769 hartree
zpe.thermalcorrenthalpy: 0.416714 hartree
zpe.thermalcorrgfe: 0.326400 hartree
zpe.sumelectzpe: -1253.493060 hartree
zpe.sumelectthermal: -1253.465722 hartree
zpe.sumelectthermalent: -1253.464778 hartree
zpe.sumelectthermalfe: -1253.555091 hartree
dipole: 2.2377 0.9838 -1.9313
dipole: 3.1153
quadrupole: -139.3240 -137.6065 -150.2163
quadrupole: 2.3618 9.4105 8.6631
quadrupole: 3.0583 4.7758 -7.8341 2.3618 9.4105 8.6631
hfenergy: -1253.8814912 hartree
pointgroup: C01 [X(C13H24N4O7)]
dipole: -0.781119 -0.4073501 -0.8521564 debye
polarizability: 218.8376792|8.6167523|198.7287586|4.0057002|3.1200128|161.870694 unknown
InChI: InChI=1S/C13H24N4O7/c14-4-2-1-3-8(16-11(21)7(15)6-18)12(22)17-9(13(23)24)5-10(19)20/h7-9,16-19,23H,1-6,14-15H2
charge 0 multiplicity 1
48 atoms
O  0.436918 1.351543 1.973215
O  0.067267 -1.550559 -1.675902
O  -2.382566 -4.945645 0.002781
O  3.516527 3.254311 -0.417175
O  4.856053 2.659242 1.387575
O  2.571637 -1.058445 -1.527018
O  2.357355 -1.980684 0.602472
N  -1.014335 -0.560689 0.154282
N  1.728754 1.256721 0.031399
N  -6.732324 2.971435 -0.699025
N  -1.159224 -2.811801 1.539516
C  -0.71338 0.854858 -0.148885
C  -1.908822 1.772078 0.181266
C  -3.177258 1.447061 -0.635938
C  -4.356673 2.379575 -0.282577
C  0.526617 1.21368 0.716975
C  3.010726 1.167745 0.731531
C  -5.641473 2.046846 -1.068477
C  -0.553392 -1.62626 -0.550327
C  -0.844768 -2.987079 0.10855
C  3.865236 -0.060785 0.215063
C  -2.052983 -3.648267 -0.604252
C  3.883168 2.420482 0.642469
C  2.890324 -1.160113 -0.187644
H  -0.466008 0.908041 -1.225664
H  -2.114029 1.706557 1.267583
H  -1.597903 2.817806 -0.011126
H  -2.952935 1.531757 -1.719706
H  -3.470489 0.392171 -0.459951
H  -4.091014 3.435303 -0.483532
H  -4.566161 2.307651 0.806187
H  -1.412082 -0.835116 1.074888
H  2.770586 1.014345 1.799011
H  1.733134 1.150208 -0.98613
H  -5.886872 0.96653 -0.908755
H  -5.442526 2.169834 -2.151019
H  0.061936 -3.603545 -0.07428
H  4.465346 0.227056 -0.663539
H  4.531143 -0.395872 1.024396
H  -2.958754 -3.037576 -0.452767
H  -1.844395 -3.738054 -1.687321
H  -7.556729 2.921854 -1.305146
H  -6.986524 2.933798 0.293657
H  -0.319654 -2.71459 2.123212
H  -1.781803 -3.551868 1.886456
H  -1.677998 -5.603583 -0.226016
H  4.133535 4.035545 -0.448716
H  1.648515 -1.4798 -1.7322
