program: Gaussian 09
title: 000196536
version: EM64L-G09RevD.01
frameworkgroup: C1[X(C10H12FN5O4)]
method: RPBEPBE
basis: SDD
operation: Freq
keyword: #p
keyword: freq=noraman
keyword: PBEPBE/SDD
title: #p freq=noraman PBEPBE/SDD
converged: NO YES NO NO
title: Mulliken charges:
elementType: F O O O O N N N N N C C C C C C C C C C H H H H H H H H H H H H
charge: -0.209415 -0.255892 -0.408538 -0.430165 -0.209479 -0.220393 -0.450132 -0.025363 -0.057061 -0.625433 -0.140194 -0.071505 -0.156030 -0.153838 -0.353899 0.361924 -0.220321 -0.143652 0.016556 0.162824 0.281170 0.259275 0.300986 0.278743 0.230069 0.232300 0.283757 0.356992 0.342500 0.354186 0.313127 0.356901
chargesum: 0.00000
title: Mulliken charges with hydrogens summed into heavy atoms:
elementType: F O O O O N N N N N C C C C C C C C C C
charge: -0.209415 -0.255892 -0.051546 -0.075978 -0.209479 -0.220393 -0.107632 -0.025363 -0.057061 0.044595 0.140975 0.187771 0.144955 0.124905 0.108470 0.361924 0.063436 -0.143652 0.016556 0.162824
polarizability: 1.98055344e+02 4.28120868e-01 1.68966611e+02 -1.23680818e+01 5.73059599e+00 9.56450652e+01
1716.lowfreq: -9.2541 -5.5541 -3.4366 -0.0011 -0.0009 -0.0009 22.6338 31.5349 62.1199
frequency: 22.5783 31.4550 62.0472 66.8805 84.7202 105.8830 112.2228 173.6787 178.5481 195.8202 216.8788 233.1197 236.0426 255.6019 269.7609 281.4931 306.0942 320.7113 333.2922 339.4926 376.7640 415.8276 462.1166 478.2186 513.2035 519.9357 543.6297 581.4165 617.2513 634.7016 645.2730 648.3115 666.9456 690.3944 711.3260 758.4811 785.3988 786.9950 812.3496 834.1735 863.8548 897.5828 931.4797 962.3965 967.4529 974.4332 1008.3722 1010.5704 1032.0521 1038.1150 1058.9945 1085.7902 1143.9904 1153.1528 1157.8484 1189.7992 1218.6624 1230.1759 1252.5662 1262.7842 1275.7681 1303.8402 1309.8593 1323.8764 1335.4114 1342.7798 1345.8845 1354.6400 1371.1205 1384.4856 1391.7873 1418.6399 1475.2999 1523.8458 1538.4605 1601.1380 1619.8246 1648.2768 2986.6639 3003.5316 3064.8102 3067.1754 3090.4090 3115.3648 3264.1421 3481.2773 3543.4349 3551.5891 3579.2215 3704.6045
redmass: 6.5485 7.1066 6.5691 7.2120 5.1564 4.5696 5.9929 8.2784 4.9065 7.0210 3.4371 2.7140 1.1575 6.9484 1.3902 2.9383 4.7564 2.9096 3.1528 3.9576 5.7615 5.5595 7.3927 4.9386 5.0462 1.1405 7.7613 1.2280 3.6440 5.1520 8.6980 9.2369 5.7422 8.9223 6.0044 2.3894 2.4320 5.0899 3.3124 6.7955 3.0077 2.9654 6.8187 3.7120 4.6222 2.8785 3.3366 4.6403 2.3588 5.4915 2.1152 2.8267 3.8547 1.3559 2.5558 2.2886 1.4810 1.3422 1.9271 1.8074 1.3819 1.6877 1.9501 1.2804 2.7358 1.3763 1.3285 1.3862 1.2259 5.8889 1.1797 4.4880 1.0832 6.0699 3.6412 1.4867 7.4705 3.9867 1.0854 1.0632 1.0906 1.0872 1.1001 1.0883 1.0984 1.0801 1.0662 1.0453 1.0669 1.1053
irintensity: 0.6384 9.3085 5.6635 6.3089 6.6890 1.6426 0.3172 0.7682 8.1005 1.4183 2.0950 15.0777 74.3241 3.8132 193.8201 8.8461 12.9046 23.0527 28.0948 20.6858 1.1139 4.6897 11.5433 19.7997 7.6368 277.2126 3.9524 83.3232 2.1876 16.3211 7.3714 5.4889 12.4466 11.0242 6.0704 30.9330 6.5594 7.3211 18.9955 9.2720 26.6551 3.1379 50.8115 67.9059 180.2381 28.1879 68.7694 49.7596 26.9083 91.1889 15.9658 9.6656 9.1647 48.7028 17.5138 84.6190 0.9130 26.4478 7.2164 7.3214 8.1763 3.6572 69.5268 10.9222 107.0681 13.9914 15.7903 8.8753 0.8745 121.7294 20.1710 29.0417 7.6949 291.7801 78.6316 4.6197 671.4006 339.6900 17.5683 30.3227 5.9976 5.9418 38.0666 2.3640 2.5802 114.2377 15.1223 102.4615 17.9177 46.7150
temp: 298.150 k
press: 1.00000 atm
elementType: 9 8 8 8 8 7 7 7 7 7 6 6 6 6 6 6 6 6 6 6 1 1 1 1 1 1 1 1 1 1 1 1
symmnumber: 1
zpe: 614678.8 jmol-1
zpe.correction: 0.234119 hartree
zpe.thermalcorrener: 0.252765 hartree
zpe.thermalcorrenthalpy: 0.253710 hartree
zpe.thermalcorrgfe: 0.186411 hartree
zpe.sumelectzpe: -1061.228908 hartree
zpe.sumelectthermal: -1061.210262 hartree
zpe.sumelectthermalent: -1061.209317 hartree
zpe.sumelectthermalfe: -1061.276616 hartree
dipole: 9.7092 6.0157 -1.2528
dipole: 11.4903
quadrupole: -140.7518 -117.3652 -117.0950
quadrupole: -42.4375 -1.0920 0.3214
quadrupole: -15.6811 7.7055 7.9756 -42.4375 -1.0920 0.3214
hfenergy: -1061.4630271 hartree
pointgroup: C01 [X(C10H12F1N5O4)]
dipole: 3.6769898 -2.6087735 -0.331689 debye
polarizability: 199.0094514|-3.5319531|162.9487918|5.9887145|21.2083874|100.7087775 unknown
InChI: InChI=1S/C10H12FN5O4/c11-4-6(18)3(1-17)20-9(4)16-2-13-5-7(16)14-10(12)15-8(5)19/h2-4,6,9,14,17-18H,1,12H2
charge 0 multiplicity 1
32 atoms
F  1.050466 -2.513114 -0.415547
O  2.49428 0.223525 1.376783
O  3.799728 -2.256256 0.070051
O  4.163203 1.442731 -1.809211
O  -4.236241 2.054166 0.54378
N  0.13127 0.401204 0.943438
N  -1.609394 -1.150042 0.017274
N  -1.208898 2.219445 1.304896
N  -3.8226 -0.16502 -0.11898
N  -3.464621 -2.374899 -0.802911
C  1.289262 -0.508533 0.99433
C  1.589441 -1.155154 -0.391533
C  3.135216 -1.107132 -0.524821
C  3.449516 0.215339 0.209983
C  3.268055 1.488029 -0.648478
C  -1.155514 0.05429 0.539762
C  0.033238 1.7390 1.420453
C  -1.977214 1.172519 0.753295
C  -3.413529 1.111236 0.407607
C  -2.993383 -1.179779 -0.290199
H  1.106744 -1.294351 1.755102
H  1.097046 -0.608873 -1.213927
H  3.476972 -1.086224 -1.569439
H  4.460981 0.178402 0.648807
H  3.435502 2.383384 -0.018853
H  2.250185 1.552458 -1.068401
H  0.896279 2.25687 1.826398
H  3.560228 -2.334326 1.029897
H  -0.986811 -1.94632 -0.151817
H  5.077479 1.714168 -1.544864
H  -2.885721 -3.198303 -0.944244
H  -4.455866 -2.404339 -1.02903
