program: Gaussian 09
title: 000017391
version: EM64L-G09RevD.01
frameworkgroup: C1[X(C15H10Cl3N5)]
method: RPBEPBE
basis: SDD
operation: Freq
keyword: #p
keyword: freq=noraman
keyword: PBEPBE/SDD
title: #p freq=noraman PBEPBE/SDD
converged: YES YES NO NO
title: Mulliken charges:
elementType: Cl Cl Cl N N N N N C C C C C C C C C C C C C C C H H H H H H H H H H
charge: -0.050497 -0.050436 0.005135 -0.415688 -0.416009 -0.141713 -0.028226 -0.028187 0.469014 0.469329 0.098648 0.098599 -0.433454 -0.299179 -0.433333 -0.299463 -0.185999 -0.204095 -0.186033 -0.204036 -0.127824 -0.127764 -0.304276 0.344517 0.344509 0.238666 0.297086 0.238803 0.296638 0.259300 0.258285 0.259317 0.258365
chargesum: 0.00000
title: Mulliken charges with hydrogens summed into heavy atoms:
elementType: Cl Cl Cl N N N N N C C C C C C C C C C C C C C C
charge: -0.050497 -0.050436 0.005135 -0.071171 -0.071500 -0.141713 -0.028226 -0.028187 0.469014 0.469329 0.098648 0.098599 -0.194788 -0.002093 -0.194531 -0.002824 0.073301 0.054190 0.073285 0.054330 -0.127824 -0.127764 -0.304276
polarizability: 3.79288010e+02 -8.15907439e-02 3.10115535e+02 -7.89492296e-02 -2.04592094e+01 8.96467004e+01
1716.lowfreq: -5.0544 -3.1598 -0.0018 -0.0005 0.0013 3.9992 24.2600 28.2954 29.1462
frequency: 24.2497 28.2106 29.1171 38.5435 73.9281 79.4322 115.4466 116.1604 156.4130 175.2270 176.4761 207.1742 207.7214 229.8818 242.6348 309.3081 318.2867 341.7674 342.5434 388.4411 390.5725 410.0517 415.3926 456.8408 468.6308 503.3662 506.7218 613.8247 618.6681 623.8590 638.4610 648.7139 655.3922 695.9336 698.8192 700.9049 703.8923 716.6639 725.8705 787.9164 790.5427 815.7237 819.7891 831.2441 845.2845 848.2429 880.0243 932.3604 942.6106 943.8695 961.7269 981.5972 994.6600 1000.4380 1040.2653 1074.4670 1075.9569 1115.4193 1115.7110 1182.8125 1187.3766 1190.3677 1191.8168 1244.6893 1252.1339 1293.9644 1298.7908 1348.9928 1350.7015 1389.2530 1397.2051 1406.0793 1411.6650 1476.7623 1477.4701 1504.4087 1505.6402 1535.8743 1571.4835 1595.7411 1604.1117 1606.7948 1609.4026 3129.4732 3129.7066 3164.9694 3165.3787 3174.5871 3174.7516 3202.6764 3203.3742 3518.0388 3518.8087
redmass: 13.7225 3.8233 7.1545 14.4387 4.5959 10.3527 10.7086 8.7437 17.5831 12.8094 9.7443 6.9788 9.4030 16.2394 8.6331 5.2694 6.7711 5.9704 5.5264 7.2349 16.0550 2.9794 3.0753 10.4768 9.4563 2.7424 2.8465 7.7491 7.0358 4.7090 8.0080 3.9958 2.9561 2.9970 2.1294 4.0102 3.7830 3.1170 2.9072 6.8373 6.7291 1.3251 1.4191 1.5836 1.3665 4.4174 10.8550 6.4790 1.3552 1.3746 1.3408 1.5087 4.2113 2.7820 7.8941 2.6277 2.6518 1.3554 1.3624 1.1289 1.2360 3.1612 5.3229 2.7447 3.1730 1.3070 1.3469 3.6873 5.0688 8.5555 4.3635 3.6211 3.4016 2.3815 2.7422 8.8835 2.1849 2.8425 7.2370 4.8474 4.3366 6.4698 5.9655 1.0905 1.0904 1.0914 1.0914 1.0954 1.0954 1.0945 1.0942 1.0753 1.0754
irintensity: 0.0020 0.3329 0.0126 0.6751 0.2961 0.3181 0.3453 0.0580 0.2869 1.2387 2.1956 3.1781 0.0963 1.4789 0.8915 3.0312 2.5941 0.8214 0.3201 1.9051 38.0829 0.2197 0.0027 15.6540 17.2573 71.4783 0.1768 0.6981 0.1167 15.4986 1.8844 4.1684 0.4341 27.8084 69.8132 0.9778 8.2449 5.6349 7.0270 87.2447 26.6509 49.1709 0.0545 149.9343 0.0608 27.3829 0.3888 94.2077 2.7970 1.4302 1.7381 12.2790 16.6801 47.2218 0.7410 27.9976 65.3911 4.3831 8.7605 2.3265 64.7586 119.0947 7.0611 174.4393 5.6923 7.2796 9.7062 42.8051 381.5272 229.8868 0.1055 53.2069 116.3286 292.2665 170.7347 2182.7650 26.5108 3.0772 408.0924 25.1866 218.2979 3.6286 73.2816 7.3766 11.2423 1.7173 1.6119 2.9974 2.5994 7.0793 2.1290 94.7652 27.3666
temp: 298.150 k
press: 1.00000 atm
elementType: 17 17 17 7 7 7 7 7 6 6 6 6 6 6 6 6 6 6 6 6 6 6 6 1 1 1 1 1 1 1 1 1 1
symmnumber: 1
zpe: 595780.3 jmol-1
zpe.correction: 0.226921 hartree
zpe.thermalcorrener: 0.246628 hartree
zpe.thermalcorrenthalpy: 0.247572 hartree
zpe.thermalcorrgfe: 0.175345 hartree
zpe.sumelectzpe: -2229.965627 hartree
zpe.sumelectthermal: -2229.945919 hartree
zpe.sumelectthermalent: -2229.944975 hartree
zpe.sumelectthermalfe: -2230.017202 hartree
dipole: 0.2443 0.0047 -0.0004
dipole: 0.2444
quadrupole: -183.3936 -134.4561 -156.5330
quadrupole: 0.0476 -0.0324 -6.8893
quadrupole: -25.2660 23.6714 1.5946 0.0476 -0.0324 -6.8893
hfenergy: -2230.1925476 hartree
pointgroup: C01 [X(C15H10Cl3N5)]
dipole: -0.0961383 -0.0008276 -0.0001468 debye
polarizability: 379.278647|-0.8114787|309.7488928|0.2544826|22.389194|90.0227056 unknown
InChI: InChI=1S/C15H10Cl3N5/c16-9-1-5-11(6-2-9)19-14-21-13(18)22-15(23-14)20-12-7-3-10(17)4-8-12/h1-8,19-20H
charge 0 multiplicity 1
33 atoms
Cl 4.41061 4.279388 -0.142312
Cl 4.30648 -4.382659 0.136728
Cl -5.755845 0.069822 -0.000539
N  -1.34186 2.40478 0.115505
N  -1.400323 -2.372375 -0.113294
N  -1.229089 0.014341 0.002263
N  -3.368522 -1.165831 -0.074468
N  -3.338937 1.246817 0.07515
C  0.027676 2.77715 0.056186
C  -0.04003 -2.777461 -0.054801
C  -1.952193 1.173592 0.058093
C  -1.980502 -1.126682 -0.055416
C  0.346354 4.117448 0.407666
C  1.062125 1.901187 -0.365447
C  0.247707 -4.121916 -0.416715
C  1.01382 -1.929594 0.376057
C  1.675455 4.580025 0.347004
C  2.393974 2.362678 -0.4247
C  1.565545 -4.616023 -0.357994
C  2.334427 -2.422585 0.433359
C  2.687847 3.69175 -0.066198
C  2.597736 -3.755031 0.063876
C  -3.943508 0.047782 -0.000113
H  -2.023799 3.163218 0.213076
H  -2.100306 -3.113876 -0.213176
H  -0.444226 4.80327 0.735121
H  0.82008 0.877423 -0.651757
H  -0.55818 -4.786164 -0.751209
H  0.79534 -0.902908 0.670753
H  1.916767 5.611093 0.619826
H  3.190927 1.6911 -0.757257
H  1.783128 -5.650171 -0.639041
H  3.146323 -1.772786 0.772872
