program: Gaussian 09
title: 000188471
version: EM64L-G09RevD.01
frameworkgroup: C1[X(C15H13BrCl2)]
method: RPBEPBE
basis: SDD
operation: Freq
keyword: #p
keyword: freq=noraman
keyword: PBEPBE/SDD
title: #p freq=noraman PBEPBE/SDD
converged: NO YES NO NO
title: Mulliken charges:
elementType: Br Cl Cl C C C C C C C C C C C C C C C H H H H H H H H H H H H H
charge: -0.019939 -0.056589 -0.049958 -0.368782 -0.482221 0.537896 0.519436 -0.658717 -0.404247 -0.436225 -0.371764 -0.363734 -0.215342 -0.205032 -0.231665 -0.213486 -0.113212 -0.117584 0.253434 0.278281 0.242915 0.249065 0.232961 0.235011 0.242245 0.239737 0.253368 0.254942 0.257698 0.255005 0.256503
chargesum: 0.00000
title: Mulliken charges with hydrogens summed into heavy atoms:
elementType: Br Cl Cl C C C C C C C C C C C C C C C
charge: -0.019939 -0.056589 -0.049958 -0.115348 -0.203940 0.537896 0.519436 0.066223 -0.169236 -0.193980 -0.132027 -0.110366 0.039600 0.052666 0.023340 0.043017 -0.113212 -0.117584
polarizability: 2.62171062e+02 -1.79697218e+00 1.79686020e+02 -8.10154638e+00 9.54199682e+00 1.49027348e+02
1716.lowfreq: -0.0019 0.0010 0.0020 2.1405 5.1218 8.3633 26.5544 35.4035 44.4465
frequency: 26.4656 35.3941 44.4094 47.7652 50.5720 109.9601 121.9456 137.4469 158.0093 195.1565 234.2819 258.1354 282.4307 298.1074 312.6716 330.8580 351.9668 406.7667 408.0500 409.9774 411.4927 459.8575 499.1307 513.8658 574.6974 622.6498 626.6101 665.9982 679.3537 719.1113 728.9581 787.3612 821.2717 826.1741 830.3376 842.0793 851.0019 919.8833 949.2605 954.2729 964.0173 966.5229 998.6378 999.3634 1005.1907 1072.1821 1075.5206 1077.0147 1104.5428 1108.0816 1134.4379 1170.5066 1180.0416 1186.7962 1191.0860 1206.4636 1246.4892 1286.0704 1297.7446 1303.5728 1347.7570 1374.5050 1381.2697 1394.6386 1397.3146 1402.8865 1463.1534 1473.1708 1474.0776 1480.1145 1584.7778 1588.0152 1594.4091 1601.4764 2989.7123 3005.3129 3060.9959 3085.3099 3107.0580 3129.1182 3130.7558 3137.6604 3141.4485 3169.0787 3169.2980 3172.4553 3173.0539
redmass: 14.4688 4.0968 4.5441 5.4824 9.2686 4.8535 8.0108 8.2094 13.2618 9.3827 1.5720 3.0704 3.2988 6.0077 3.1447 4.7500 4.9168 3.1098 3.2664 5.1768 3.4456 5.7070 3.0408 3.6298 3.5404 6.9442 7.0316 5.7993 4.9744 3.7838 3.5087 2.4998 1.9014 1.2590 1.2529 2.0714 2.6015 2.0041 1.3668 1.4068 1.3808 1.3735 3.3273 3.8161 1.6998 2.6277 2.3724 2.6357 1.6968 1.4451 1.8371 1.2070 3.2013 1.1179 1.1581 2.2608 1.4994 1.3711 1.2850 1.3373 1.6089 5.4942 5.3213 1.3156 2.2889 2.1727 1.0477 1.2781 1.6632 2.3895 7.3896 7.1900 6.2188 6.2506 1.0365 1.0834 1.0875 1.0974 1.0999 1.0899 1.0899 1.0888 1.0888 1.0954 1.0952 1.0963 1.0959
irintensity: 0.0843 0.1662 0.1316 1.0589 0.6211 0.0634 0.5414 0.0880 0.8770 0.2217 0.9613 1.3375 1.3102 0.3771 3.0235 0.1005 10.7664 0.9838 1.4501 7.3171 2.5229 2.2492 37.7533 24.5192 49.7688 0.6274 0.2892 19.7813 7.8806 2.9868 5.4292 41.4289 60.1363 0.2273 0.1883 24.9744 5.2043 10.7498 0.3370 1.8803 0.3342 0.0733 36.1672 49.9732 21.2701 63.5019 33.8402 14.3586 5.2559 0.6623 25.8181 42.5946 0.5274 0.3575 0.6512 0.5298 14.8433 0.9136 0.8934 2.8398 4.1690 0.4841 0.0411 21.0640 7.3599 3.4527 11.7152 52.5613 51.2472 73.5884 1.2279 1.8948 11.5634 7.5401 15.5196 6.6354 3.2632 23.6058 18.2653 6.5509 10.8827 13.2356 4.5803 3.7612 7.4110 0.7832 0.7588
temp: 298.150 k
press: 1.00000 atm
elementType: 35 17 17 6 6 6 6 6 6 6 6 6 6 6 6 6 6 6 1 1 1 1 1 1 1 1 1 1 1 1 1
symmnumber: 1
zpe: 610734.6 jmol-1
zpe.correction: 0.232617 hartree
zpe.thermalcorrener: 0.249942 hartree
zpe.thermalcorrenthalpy: 0.250886 hartree
zpe.thermalcorrgfe: 0.184086 hartree
zpe.sumelectzpe: -1511.698801 hartree
zpe.sumelectthermal: -1511.681476 hartree
zpe.sumelectthermalent: -1511.680531 hartree
zpe.sumelectthermalfe: -1511.747332 hartree
dipole: -1.9662 1.1280 0.2276
dipole: 2.2782
quadrupole: -148.3275 -139.6411 -116.6550
quadrupole: -5.0587 -3.4823 0.3829
quadrupole: -13.4530 -4.7666 18.2195 -5.0587 -3.4823 0.3829
hfenergy: -1511.9314179 hartree
pointgroup: C01 [X(C15H13Br1Cl2)]
dipole: 0.8369762 -0.3131876 0.068788 debye
polarizability: 260.8770897|11.2633856|181.5686629|7.6788369|-7.7452154|148.4386767 unknown
InChI: InChI=1S/C15H13BrCl2/c1-10(16)15(11-2-6-13(17)7-3-11)12-4-8-14(18)9-5-12/h2-10,15H,1H3
charge 0 multiplicity 1
31 atoms
Br -1.551464 -3.648301 -0.142295
Cl -4.995311 2.444223 -0.046206
Cl 5.096304 2.210327 -0.407462
C  -0.011469 -1.187107 0.416234
C  0.067531 -2.42613 -0.515396
C  -1.282368 -0.338974 0.267385
C  1.248899 -0.319672 0.212861
C  1.329221 -3.278741 -0.349053
C  -1.729015 0.40967 1.385422
C  2.286332 -0.330415 1.178194
C  -1.999205 -0.218745 -0.949274
C  1.407259 0.487297 -0.94322
C  -2.853678 1.25851 1.304413
C  3.459583 0.437932 1.002655
C  -3.128775 0.623418 -1.052975
C  2.574974 1.255408 -1.141584
C  -3.537376 1.35409 0.077589
C  3.586895 1.21728 -0.162392
H  0.017218 -1.574462 1.453311
H  -0.079975 -2.14899 -1.572847
H  2.222584 -2.691049 -0.630487
H  1.282718 -4.170659 -0.99491
H  1.448912 -3.614807 0.695976
H  -1.191004 0.332984 2.337866
H  2.183393 -0.944217 2.080827
H  -1.709789 -0.802098 -1.829793
H  0.607201 0.539443 -1.68948
H  -3.190717 1.829329 2.174206
H  4.25411 0.429017 1.75431
H  -3.682636 0.701773 -1.992836
H  2.691748 1.877764 -2.03344
