program: Gaussian 09
title: 000196618
version: EM64L-G09RevD.01
frameworkgroup: C1[X(C20H30F2O2)]
method: RPBEPBE
basis: SDD
operation: Freq
keyword: #p
keyword: freq=noraman
keyword: PBEPBE/SDD
title: #p freq=noraman PBEPBE/SDD
converged: YES YES NO NO
title: Mulliken charges:
elementType: F F O O C C C C C C C C C C C C C C C C C C C C H H H H H H H H H H H H H H H H H H H H H H H H H H H H H H
charge: -0.205744 -0.207231 -0.430779 -0.271078 -0.394953 -0.339587 -0.470179 -0.344794 -0.256626 -0.698396 -0.375415 -0.486274 -0.179980 -0.543112 -0.480533 -0.181717 -0.548912 -0.124986 -0.153488 0.217881 -0.276303 -0.124471 -0.275309 0.204137 0.203893 0.201149 0.196060 0.190065 0.209365 0.203327 0.186519 0.205897 0.274849 0.207283 0.213618 0.214743 0.215800 0.232897 0.200226 0.223201 0.231100 0.235269 0.264467 0.248772 0.263578 0.225615 0.220553 0.209111 0.251298 0.231461 0.274233 0.256416 0.258732 0.398350
chargesum: 0.00000
title: Mulliken charges with hydrogens summed into heavy atoms:
elementType: F F O O C C C C C C C C C C C C C C C C C C C C
charge: -0.205744 -0.207231 -0.032429 -0.271078 0.010089 0.046539 -0.057487 0.047622 0.018224 -0.062751 0.073281 -0.062847 0.051120 -0.043376 0.031817 0.043899 -0.119249 0.126313 0.077974 0.217881 -0.002071 0.131945 -0.016578 0.204137
polarizability: 2.71548698e+02 8.41116756e+00 2.28474025e+02 4.95777510e+00 8.45753646e-01 1.85400720e+02
1716.lowfreq: -17.7811 -2.0797 -1.7027 -0.0007 -0.0005 -0.0002 6.7067 19.0621 28.2364
frequency: -13.1122 17.9735 28.1157 37.8345 39.7013 42.6083 52.4981 63.5322 65.9884 70.1619 81.6099 86.6282 93.5273 125.7057 135.4430 138.5214 152.9279 173.0201 175.1230 186.7162 194.5700 199.9933 228.1293 234.7012 255.9973 260.7509 280.8042 308.4875 333.8454 341.3064 351.5322 382.4337 385.7658 420.1692 439.3641 452.1536 461.6612 478.6240 505.7928 516.9641 523.6022 552.6895 602.1406 662.7016 725.2498 730.3311 741.7445 763.6568 773.7730 786.6162 803.9649 816.0562 826.9174 839.6169 848.4318 890.2650 893.8565 904.3605 913.9675 919.2155 934.5803 941.9903 972.9588 979.3693 981.3547 983.6357 992.9586 1005.5862 1011.8115 1031.5655 1048.3683 1060.9735 1066.9344 1070.1560 1075.9461 1083.6180 1086.7444 1103.9823 1111.9654 1121.5141 1147.8531 1156.0512 1172.6941 1177.8980 1191.3072 1201.3933 1205.9607 1214.1798 1244.3126 1256.6978 1262.3973 1269.2068 1273.5343 1274.8533 1281.7865 1288.4504 1289.1377 1291.8976 1295.9949 1298.8342 1305.2445 1311.2402 1313.2779 1319.1558 1331.4983 1333.8467 1353.3997 1359.9749 1373.9591 1390.2108 1435.2876 1437.7045 1459.2921 1463.3188 1466.6310 1467.0819 1469.4933 1474.8064 1477.8961 1479.1662 1487.6939 1642.9687 1662.6977 1671.1835 1678.7176 1682.0996 2929.0735 2959.3713 2962.5588 2968.3974 2971.7599 2972.4175 2983.8445 2985.7543 2991.2192 3000.1404 3001.0478 3017.4988 3025.8632 3037.0628 3039.5724 3042.0093 3044.1889 3049.2333 3060.1778 3068.3723 3069.2170 3070.7990 3076.5626 3077.0443 3086.5191 3111.0653 3120.0703 3129.0096 3138.1745 3268.2372
redmass: 4.1469 4.6044 4.0733 5.7861 4.7333 5.4360 4.0063 4.2932 3.9519 2.5712 2.8548 3.6145 2.8685 2.5104 2.4453 2.6486 2.6033 2.5582 4.3821 2.8372 3.4965 2.9239 1.5253 1.5541 3.8167 3.3728 2.8297 2.7129 3.2309 3.1539 3.6209 3.6172 2.4903 3.0329 3.9365 3.6344 3.3952 2.5658 3.4213 3.8961 2.5890 3.4361 4.6429 4.7303 1.0891 1.1544 1.4243 1.7181 2.2119 1.4940 1.7223 1.9577 2.0300 2.1629 1.9068 1.7910 2.5660 2.5261 2.8024 1.7900 2.0919 1.8721 1.1204 1.2417 2.4113 1.1859 1.6342 1.8414 1.1057 2.0421 2.7273 2.7408 2.1472 2.9505 2.0073 3.1654 2.1459 2.2812 2.4290 3.4502 2.3103 1.4448 1.3258 1.4386 3.0694 1.3219 1.2538 1.3747 1.2515 1.3064 1.3016 1.2850 1.2332 1.2398 1.2544 1.1014 1.2280 1.2671 1.3209 1.2604 1.2598 1.4036 1.2521 1.3533 1.4026 1.4822 1.5799 1.4415 1.7856 1.2182 1.0880 1.0775 1.0957 1.0947 1.0735 1.0713 1.0843 1.1006 1.0423 1.0681 1.0861 7.7987 6.2066 6.3556 6.6867 6.7214 1.0669 1.0594 1.0592 1.0618 1.0420 1.0558 1.0600 1.0600 1.0617 1.0616 1.0951 1.1011 1.0996 1.0983 1.1037 1.0916 1.0990 1.1001 1.0934 1.1012 1.1004 1.0998 1.0882 1.0958 1.0886 1.0914 1.0946 1.0878 1.0904 1.0665
irintensity: 0.1934 0.6087 0.2876 0.9931 0.4813 0.2560 0.0591 2.2016 0.9643 0.3253 0.3851 2.1048 0.6355 0.0857 0.4871 0.4304 0.1623 0.1723 3.2069 4.0617 0.1743 6.3835 0.9300 2.3645 1.4735 0.5435 0.1076 0.4027 0.8799 0.4562 3.6788 1.1926 0.0304 3.0109 7.6284 24.2805 2.4914 6.0822 0.0434 10.5365 0.3868 14.1806 12.3834 18.0457 36.1699 22.0707 28.9004 5.4620 29.4126 4.7481 7.1994 6.4703 0.6675 9.3224 16.0065 4.2393 14.4204 12.0507 46.1760 43.8132 4.2600 11.8826 44.4607 59.5787 8.2183 72.1742 2.1599 29.4800 76.7765 18.1124 21.8279 7.6254 36.6337 93.1975 112.1886 71.4367 16.5951 37.2524 6.9456 83.9298 12.4633 26.9978 1.5151 9.5001 51.9888 0.5915 10.8922 1.8292 2.3867 2.2014 6.2718 0.1250 1.5492 4.2022 5.4615 1.6881 0.5957 7.0773 14.7255 13.4814 3.3197 3.2771 1.2305 2.4537 7.0516 22.3524 2.1964 10.6912 39.1647 12.7082 42.9957 9.1906 9.9592 13.9212 0.1054 6.0212 14.5939 7.2140 11.5832 2.5459 15.6930 154.2783 12.3664 14.0617 6.5584 52.7389 16.4066 0.5838 9.1168 39.3428 77.2345 43.0895 35.2973 45.5771 9.6534 42.2952 3.3751 8.3694 23.8142 8.2576 93.5004 0.4317 9.0247 7.7602 12.1845 40.9729 84.5369 71.3747 36.7484 3.8250 50.7746 6.0412 3.9204 8.0084 2.0748 424.7770
temp: 298.150 k
press: 1.00000 atm
elementType: 9 9 8 8 6 6 6 6 6 6 6 6 6 6 6 6 6 6 6 6 6 6 6 6 1 1 1 1 1 1 1 1 1 1 1 1 1 1 1 1 1 1 1 1 1 1 1 1 1 1 1 1 1 1
symmnumber: 1
zpe: 1189592.9 jmol-1
zpe.correction: 0.453092 hartree
zpe.thermalcorrener: 0.480691 hartree
zpe.thermalcorrenthalpy: 0.481635 hartree
zpe.thermalcorrgfe: 0.392359 hartree
zpe.sumelectzpe: -1128.325416 hartree
zpe.sumelectthermal: -1128.297817 hartree
zpe.sumelectthermalent: -1128.296873 hartree
zpe.sumelectthermalfe: -1128.386149 hartree
dipole: -2.1311 3.0924 -0.3016
dipole: 3.7677
quadrupole: -138.2748 -150.5161 -150.5179
quadrupole: 15.6199 -1.3188 3.3742
quadrupole: 8.1614 -4.0798 -4.0816 15.6199 -1.3188 3.3742
hfenergy: -1128.7785084 hartree
pointgroup: C01 [X(C20H30F2O2)]
dipole: 1.0671443 -0.950967 -0.3926237 debye
polarizability: 226.9863747|14.8076947|268.6020203|-11.7040189|6.5145517|189.8350482 unknown
InChI: InChI=1S/C20H30F2O2/c1-2-3-4-5-6-8-11-14-17-20(21,22)18-15-12-9-7-10-13-16-19(23)24/h6-9,14-15,17-18,23H,2-5,10-13,16H2,1H3
charge 0 multiplicity 1
54 atoms
F  -2.554345 3.849375 1.418299
F  -3.307931 2.659661 -0.410694
O  0.673926 -1.430688 -0.19713
O  1.043683 -0.47068 1.885505
C  -0.525804 -4.802163 -0.437975
C  -0.699898 -4.094607 -1.80157
C  -1.69101 -4.519701 0.558112
C  0.542037 -4.225408 -2.711889
C  -1.583411 -3.185819 1.27466
C  0.344638 -3.565417 -4.093446
C  3.309978 1.070375 0.855329
C  4.014838 2.223105 0.075586
C  -2.421772 -2.124964 1.098401
C  -2.384898 -0.838239 1.908581
C  2.449313 0.172895 -0.057373
C  2.999226 3.087257 -0.656042
C  1.077313 4.759871 -0.723999
C  -2.612836 0.412539 1.081088
C  2.269782 4.072108 -0.069798
C  -2.155601 2.826741 0.456503
C  -1.892217 1.552869 1.218849
C  -0.186113 4.347712 0.020261
C  -1.001927 3.336196 -0.367378
C  1.358521 -0.586939 0.676249
H  0.436581 -4.4933 0.019774
H  -0.451942 -5.895158 -0.607351
H  -0.91515 -3.01795 -1.647169
H  -1.586128 -4.518806 -2.318662
H  -1.707219 -5.32057 1.325071
H  -2.654483 -4.579121 0.014161
H  0.791003 -5.298705 -2.843701
H  1.406919 -3.759417 -2.198691
H  -0.790303 -3.110073 2.038235
H  -0.49965 -4.028421 -4.638756
H  1.248154 -3.66465 -4.723005
H  0.123943 -2.486813 -3.984911
H  4.064151 0.459129 1.386728
H  2.65784 1.51241 1.630557
H  4.747207 1.801484 -0.639881
H  4.58641 2.832369 0.801425
H  -3.229553 -2.208579 0.353138
H  -3.206047 -0.892556 2.659206
H  -1.43857 -0.762924 2.474392
H  3.058983 -0.549903 -0.631625
H  1.923278 0.788141 -0.813568
H  2.781844 2.83029 -1.704608
H  1.187593 5.861177 -0.684989
H  1.013874 4.464093 -1.787362
H  -3.439029 0.391951 0.355881
H  2.472761 4.342541 0.978568
H  -1.051714 1.612174 1.920765
H  -0.402455 4.867809 0.963527
H  -0.823465 2.773735 -1.292508
H  -0.118223 -1.863335 0.250432
