program: Gaussian 09
title: 000017357
version: EM64L-G09RevD.01
frameworkgroup: C1[X(C9H6Cl8)]
method: RPBEPBE
basis: SDD
operation: Freq
keyword: #pfreq=noraman
keyword: PBEPBE/SDD
title: #p freq=noraman PBEPBE/SDD
converged: YES YES NO NO
title: Mulliken charges:
elementType: Cl Cl Cl Cl Cl Cl Cl Cl C C C C C C C C C H H H H H H
charge: 0.095124 0.067836 0.139445 0.098926 0.083260 0.079899 -0.025839 -0.042034 -0.159898 -0.186719 -0.005368 -0.038563 -0.497329 -0.022309 -0.021700 -0.702708 -0.664890 0.336690 0.295245 0.300383 0.284207 0.292004 0.294339
chargesum: 0.00000
title: Mulliken charges with hydrogens summed into heavy atoms:
elementType: Cl Cl Cl Cl Cl Cl Cl Cl C C C C C C C C C
charge: 0.095124 0.067836 0.139445 0.098926 0.083260 0.079899 -0.025839 -0.042034 -0.159898 -0.186719 0.331321 0.256682 -0.497329 -0.022309 -0.021700 -0.118118 -0.078548
polarizability: 1.73095413e+02 -9.24539499e+00 1.77362467e+02 1.04141199e+01 -2.58731339e+00 1.45209482e+02
1716.lowfreq: -10.7880 -2.2569 -0.0017 0.0012 0.0012 6.3268 34.5968 39.6534 72.0811
frequency: 34.5152 39.6227 72.0796 76.1821 94.8785 104.9851 128.3317 143.9750 151.5283 152.5571 158.5475 161.1595 170.7482 199.9815 214.8936 223.7089 253.4776 302.9755 320.6152 329.0970 348.4085 376.1509 421.0734 475.1796 504.3890 530.3732 601.8877 616.3571 659.7838 681.6796 696.6065 722.8311 807.3297 843.0389 850.4434 858.3849 902.8740 964.3030 988.9205 991.9851 1024.5079 1039.2594 1102.0917 1106.0661 1125.2363 1135.9787 1146.3919 1192.7737 1248.1356 1260.2750 1277.9433 1296.3620 1335.4939 1351.5723 1449.4932 1455.8932 1605.1719 3017.2783 3054.5908 3064.2377 3082.9448 3138.3079 3175.2431
redmass: 20.4884 14.3811 19.4242 18.3861 17.5386 21.6887 26.3977 18.8880 18.1706 27.2123 15.9338 13.8393 3.5172 5.9508 16.3881 11.8771 15.2354 5.2292 14.0630 13.3745 27.5816 9.5026 7.1100 3.5035 7.9334 7.5665 11.3013 8.5915 7.5130 7.5222 5.2798 6.2711 8.5164 3.7426 8.0039 2.5224 3.1377 5.1996 3.9952 2.5010 5.3059 4.9866 2.7677 2.9833 4.2912 2.4264 2.0693 1.4774 1.2703 1.1633 1.3087 1.2118 1.3530 1.2500 1.0874 1.0926 12.0212 1.0851 1.0637 1.0779 1.0576 1.1098 1.1097
irintensity: 0.4336 1.6295 0.6957 0.2793 0.8700 0.8363 0.4642 0.1528 0.9314 0.1167 0.9681 1.1599 2.5697 1.3964 0.2962 0.2528 1.9176 1.1625 1.4824 1.3620 0.6591 5.9856 8.2035 8.7885 6.0849 41.3689 20.1969 37.0410 23.0303 12.5565 63.0839 18.7025 60.9998 5.9562 23.7555 9.3209 9.4236 48.7717 3.7484 3.6795 7.0559 38.5535 7.1276 2.7121 6.0511 54.3016 13.1302 16.9748 5.1935 4.2659 6.3728 28.8149 1.4144 2.0627 12.4779 10.5549 55.0262 2.2808 5.0323 3.3253 5.7513 1.1979 1.2497
temp: 298.150 k
press: 1.00000 atm
elementType: 17 17 17 17 17 17 17 17 6 6 6 6 6 6 6 6 6 1 1 1 1 1 1
symmnumber: 1
zpe: 340105.0 jmol-1
zpe.correction: 0.129539 hartree
zpe.thermalcorrener: 0.148068 hartree
zpe.thermalcorrenthalpy: 0.149013 hartree
zpe.thermalcorrgfe: 0.080703 hartree
zpe.sumelectzpe: -4025.713169 hartree
zpe.sumelectthermal: -4025.694639 hartree
zpe.sumelectthermalent: -4025.693695 hartree
zpe.sumelectthermalfe: -4025.762005 hartree
dipole: -0.9482 1.5228 -1.5184
dipole: 2.3502
quadrupole: -165.9400 -156.8324 -153.1499
quadrupole: 1.0803 1.4348 2.5391
quadrupole: -7.2992 1.8083 5.4909 1.0803 1.4348 2.5391
hfenergy: -4025.8427077 hartree
pointgroup: C01[X(C9H6Cl8)]
dipole: 0.1775704 -0.6585331 -0.6242959 debye
dipolederiv: -0.098749 0.0086683 0.0103167 0.0063899 -0.3332307 -0.2118136 0.0173682 -0.2468625 -0.2710866 -0.2141206 0.1938696 0.0124343 0.1565668 -0.543286 -0.0482638 0.0011781 -0.0255178 -0.0845591 -0.5824795 -0.074208 -0.1596256 -0.0935009 -0.0891604 0.0038089 -0.1387304 0.0185272 -0.1722418 -0.3398974 -0.1568782 0.1700936 -0.1850211 -0.216902 0.201888 0.1967581 0.2152458 -0.451628 -0.0106323 -0.1290309 0.0758287 -0.1037957 -0.5634546 0.1822973 0.0887322 0.2861144 -0.1002603 -0.1444067 0.078377 0.2904138 0.0419284 -0.0578987 -0.0785104 0.3456211 -0.1615689 -0.4876634 -0.2974071 0.2036492 0.0215695 0.2256259 -0.4218973 -0.0211243 0.0651985 -0.0894285 -0.1692862 -0.5696696 -0.1625719 -0.0915859 -0.0419369 -0.2374779 0.0091981 -0.1520753 -0.0288539 -0.1877966 0.1003439 -0.0473237 0.0009109 -0.103231 0.3677884 0.3789212 -0.0677963 0.4440421 0.3637597 0.2050313 -0.3589586 0.0395101 -0.228859 0.7061456 0.0931601 0.1005599 -0.0162206 0.0227475 0.0245597 0.0853352 0.0984747 0.1021747 -0.1475738 -0.0491848 0.0817912 -0.0979913 -0.1158758 -0.0897108 -0.0025753 -0.0595518 0.1032383 -0.1542478 0.0301066 -0.0582705 0.0631223 0.0172957 0.9932798 0.3112077 -0.0116306 0.3441262 0.2138822 -0.3286628 -0.0793128 -0.3395904 0.7324625 -0.1007602 0.1506398 -0.0977707 0.1658384 0.7109 -0.3762968 -0.0259209 -0.3769844 -0.089563 0.0954274 -0.0570076 -0.4555895 -0.121334 -0.1444114 0.2174097 -0.4845596 0.2641959 0.5903619 0.2824394 -0.2697358 -0.1100182 -0.3890417 0.5127055 0.0621287 -0.1275845 0.1067914 0.1746371 0.6574919 0.1189013 0.1811896 0.0874125 0.1786485 -0.0044067 0.1425547 -0.001856 0.1616814 0.0105131 0.0041974 0.0502125 -0.0361793 0.0787035 0.0397671 0.0245283 0.0319015 0.017866 0.0484149 0.0197481 -0.0157814 -0.0297131 0.0419029 0.0170218 -0.0143169 0.018667 -0.0526387 -0.0184223 0.0346066 -0.0232141 0.0141856 0.0256364 -0.072431 -0.0152825 -0.0620506 0.0521149 0.0329256 -0.0075156 0.1148427 0.049962 -0.0121085 0.0052702 0.0864464 -0.0079974 -0.0011006 0.0164588 0.0070276 -0.0270296 0.0262357 0.101932 -0.008476 0.0317205 0.0518733 -0.0219713 -0.0006303 0.049578 -0.0139997 0.0089285 -0.0165957 -0.0418075 -0.0186074 -0.0455587 0.0727447 unknown
polarizability: 168.1749201|-6.0613042|181.6963445|-9.5641936|6.9719953|145.7960979 unknown
InChI: InChI=1S/C9H6Cl8/c10-1-3-4(2-11)8(15)6(13)5(12)7(3,14)9(8,16)17/h3-4H,1-2H2
charge 0 multiplicity 1
23 atoms
Cl 0.036946 2.294302 1.831947
Cl 1.507419 -2.782348 -0.296433
Cl 2.600683 -0.104808 1.736976
Cl -0.035475 -1.191839 2.589106
Cl 1.357739 2.769853 -1.27597
Cl 2.258936 -0.410634 -2.591113
Cl -2.919421 2.619428 -0.034511
Cl -3.388584 -2.13206 -0.803802
C  0.138348 0.914812 0.632604
C  0.73645 -1.116854 -0.197994
C  -1.245832 0.325102 0.143954
C  -0.818917 -1.058376 -0.52135
C  0.858087 -0.376454 1.175981
C  1.009658 1.167967 -0.609275
C  1.368458 -0.046413 -1.10562
C  -2.030855 1.177918 -0.856872
C  -1.641739 -2.275449 -0.08383
H  -1.87277 0.12962 1.030766
H  -0.90252 -0.988678 -1.622285
H  -2.832075 0.575212 -1.308011
H  -1.395229 1.621419 -1.638191
H  -1.78069 -2.358453 1.000175
H  -1.236714 -3.207666 -0.501552
