program: Gaussian 09
title: 000188454
version: EM64L-G09RevD.01
frameworkgroup: C1[X(C14H16O2)]
method: RPBEPBE
basis: SDD
operation: Freq
keyword: #pfreq=noraman
keyword: PBEPBE/SDD
title: #p freq=noraman PBEPBE/SDD
converged: YES YES NO NO
title: Mulliken charges:
elementType: O O C C C C C C C C C C C C C C H H H H H H H H H H H H H H H H
charge: -0.298673 -0.269021 0.220356 -0.228144 0.120329 0.446859 -0.687833 -0.688318 -0.354298 -0.601286 -0.558265 0.367314 0.187978 -0.219009 -0.534368 -0.585814 0.232105 0.238573 0.205379 0.232119 0.205007 0.232366 0.238615 0.239548 0.230338 0.262473 0.256249 0.244670 0.224271 0.224404 0.206037 0.210036
chargesum: 0.00000
title: Mulliken charges with hydrogens summed into heavy atoms:
elementType: O O C C C C C C C C C C C C C C
charge: -0.298673 -0.269021 0.220356 0.003961 0.120329 0.446859 -0.011761 -0.012330 -0.114749 -0.370947 -0.295792 0.367314 0.187978 0.037240 0.158976 -0.169741
polarizability: 2.69882562e+02 -1.45075820e+01 1.79991512e+02 4.48720309e-02 -6.67195690e-02 8.69842640e+01
1716.lowfreq: -41.3343 -7.5214 -3.7874 -0.0004 0.0002 0.0003 5.1132 55.8757 72.0190
frequency: -41.0875 55.8416 71.9972 118.6125 128.6487 155.8709 178.5691 181.8557 191.6461 229.7189 253.8403 266.9848 281.8293 301.6303 332.6472 367.2328 395.2997 406.2187 438.6045 443.8232 458.5747 545.7961 550.5955 589.0000 598.9197 619.4518 698.0728 700.0035 729.7605 767.2085 768.2936 774.6713 854.0891 859.4253 879.5097 906.0381 915.9224 917.8688 942.3181 968.2540 977.3101 994.1773 1028.3914 1047.3933 1103.1252 1110.9039 1113.3205 1159.6132 1163.4290 1187.1777 1189.2760 1208.5138 1242.8715 1269.8550 1285.8732 1309.1433 1358.5313 1370.3034 1387.5003 1389.6387 1429.0621 1438.4690 1447.9004 1449.2704 1459.3349 1467.5061 1468.7351 1472.2158 1481.3570 1494.9728 1563.7821 1621.2919 1638.4762 1655.9564 2962.9498 2986.4274 2989.6429 3052.6018 3084.7539 3090.8731 3095.9975 3100.1637 3103.8804 3115.7925 3124.6990 3130.5463 3135.1754 3144.2450 3178.4235 3199.9221
redmass: 3.6055 3.1718 2.8622 3.2705 2.9406 3.3941 3.4016 1.1937 1.6048 1.0850 1.5262 3.0658 2.8044 3.0586 3.2277 3.8089 3.4880 3.0419 2.6311 4.4377 4.1582 3.4923 5.7372 3.8744 4.9510 2.3806 2.3880 6.6334 5.4461 2.1831 3.7546 1.7134 1.7750 3.3140 2.5750 1.6069 1.3949 1.4810 2.1305 1.3064 6.4756 1.3088 1.1511 1.6663 1.6397 3.0484 1.2598 1.7021 1.8670 3.6992 1.9685 1.8853 1.7034 1.7990 2.9530 1.4845 2.1528 1.2120 3.7605 1.3826 1.7397 1.3214 1.7394 1.0491 1.0480 1.0496 1.1054 1.1442 1.0648 2.7207 8.9891 6.4625 4.4421 7.8265 1.0326 1.0348 1.0352 1.1041 1.0995 1.0992 1.0606 1.1013 1.1007 1.0850 1.0998 1.0908 1.0914 1.0989 1.0907 1.1130
irintensity: 0.5863 1.5668 3.1033 4.3710 0.1715 1.3257 1.4652 0.2462 0.7403 0.5409 0.2570 1.4100 4.9991 1.4120 3.2585 0.6881 0.4053 1.0512 5.4839 8.0966 11.6695 1.0132 6.6635 1.0576 2.9261 0.3548 21.5995 1.6054 2.1006 5.9556 0.6983 19.0245 31.4611 8.4966 36.3370 3.9847 93.8235 3.7107 6.8651 3.9487 31.9157 0.6663 21.0865 28.8090 9.9343 298.2552 0.3909 13.6445 122.4731 34.3862 76.6889 5.9063 14.1327 28.1646 67.9616 46.2975 26.5485 24.6795 39.0364 62.6082 7.8851 10.7695 12.3322 5.1269 1.1572 13.5224 9.1795 67.3850 15.8418 86.6323 30.3286 183.4100 43.8985 61.0966 68.8114 13.7822 35.2660 44.4373 1.7294 36.6266 8.1670 14.7319 39.3565 2.8754 23.8244 7.8789 8.0208 25.1032 3.5436 30.0176
temp: 298.150 k
press: 1.00000 atm
elementType: 8 8 6 6 6 6 6 6 6 6 6 6 6 6 6 6 1 1 1 1 1 1 1 1 1 1 1 1 1 1 1 1
symmnumber: 1
zpe: 683817.8 jmol-1
zpe.correction: 0.260452 hartree
zpe.thermalcorrener: 0.275463 hartree
zpe.thermalcorrenthalpy: 0.276407 hartree
zpe.thermalcorrgfe: 0.219369 hartree
zpe.sumelectzpe: -692.320044 hartree
zpe.sumelectthermal: -692.305033 hartree
zpe.sumelectthermalent: -692.304089 hartree
zpe.sumelectthermalfe: -692.361127 hartree
dipole: -2.2258 1.1750 0.0199
dipole: 2.5170
quadrupole: -86.9463 -81.8702 -99.9694
quadrupole: 7.9894 -0.0342 0.0187
quadrupole: 2.6491 7.7251 -10.3741 7.9894 -0.0342 0.0187
hfenergy: -692.5804963 hartree
pointgroup: C01 [X(C14H16O2)]
dipole: 0.8543285 -0.4999607 0.0280027 debye
polarizability: 268.393985|-18.52713|181.1619766|-0.9280025|-5.2833449|87.302377 unknown
InChI: InChI=1S/C14H16O2/c1-5-10-8-11-6-7-14(2,3)16-13(11)9-12(10)15-4/h5-9H,1H2,2-4H3
charge 0 multiplicity 1
32 atoms
O  1.766929 -1.005483 0.165285
O  -3.070074 -1.406951 0.251109
C  3.064306 -0.217498 0.116423
C  2.833589 1.282704 0.025907
C  0.523832 -0.371697 0.147623
C  0.382635 1.043502 0.067066
C  3.811289 -0.590281 1.416751
C  3.80352 -0.745836 -1.133063
C  1.598218 1.855109 0.004302
C  -0.92175 1.584053 0.050429
C  -0.606816 -1.209606 0.209916
C  -2.089392 0.784653 0.110343
C  -1.89869 -0.636271 0.191527
C  -3.45613 1.337317 0.093037
C  -2.933034 -2.861734 0.339052
C  -3.81287 2.652001 0.025914
H  3.74401 1.892078 -0.021423
H  3.248012 -0.242951 2.299149
H  4.812769 -0.122481 1.432879
H  3.932061 -1.685898 1.481045
H  4.80739 -0.289212 -1.209594
H  3.918282 -1.841989 -1.06705
H  3.236712 -0.503124 -2.047548
H  1.493356 2.944734 -0.061093
H  -1.029647 2.67344 -0.012098
H  -0.447727 -2.28866 0.270103
H  -4.252513 0.585489 0.140645
H  -3.963442 -3.24487 0.374377
H  -2.412023 -3.270701 -0.548055
H  -2.391514 -3.158824 1.257856
H  -3.08323 3.469297 -0.023629
H  -4.867757 2.945188 0.019315
