program: Gaussian 09
title: 000188443
version: EM64L-G09RevD.01
frameworkgroup: C1[X(C7H4ClNOS)]
method: RPBEPBE
basis: SDD
operation: Freq
keyword: #p
keyword: freq=noraman
keyword: PBEPBE/SDD
title: #p freq=noraman PBEPBE/SDD
converged: NO YES NO YES
title: Mulliken charges:
elementType: Cl S O N C C C C C C C H H H H
charge: -0.046283 0.222004 -0.157464 -0.423357 0.653181 -0.392976 -0.337386 -0.244682 -0.185821 -0.115373 -0.095194 0.343304 0.245650 0.273860 0.260538
chargesum: 0.00000
title: Mulliken charges with hydrogens summed into heavy atoms:
elementType: Cl S O N C C C C C C C
charge: -0.046283 0.222004 -0.157464 -0.080053 0.653181 -0.392976 -0.091736 0.029177 0.074716 -0.115373 -0.095194
polarizability: 1.83021635e+02 -9.56792957e-02 1.07517847e+02 -8.61554655e-04 1.32037448e-03 4.03030701e+01
1716.lowfreq: 0.0028 0.0033 0.0035 2.8838 4.1533 6.2406 78.1435 173.8565 180.3727
frequency: 78.1409 173.8565 180.3724 185.4076 306.4640 338.7470 351.6380 416.6502 427.0364 485.0418 530.4311 549.2635 559.9003 579.5735 655.1517 673.6415 719.6388 730.0744 808.3041 863.0969 872.2747 936.1106 1042.8767 1072.7634 1135.0920 1143.6105 1249.3466 1262.4045 1338.3324 1398.7847 1429.9775 1462.2139 1587.2141 1607.0442 1697.6599 3151.3434 3179.0748 3181.7907 3563.7579
redmass: 15.5628 7.0832 15.3310 6.0882 13.1740 9.6214 6.3313 12.2286 3.1952 9.0234 8.8830 3.6076 2.3530 7.0870 1.9367 7.2550 4.1121 8.4982 1.4510 1.3909 5.2985 1.3615 2.8202 3.3575 2.9538 1.7442 1.3258 1.9149 2.8582 5.7566 2.2985 3.6418 7.2572 7.2523 10.2615 1.0902 1.0935 1.0960 1.0786
irintensity: 0.9563 1.3588 1.0401 0.4549 0.5915 2.1945 1.4680 7.4603 12.8648 6.0591 12.5496 0.6054 45.4498 50.3008 77.6228 6.8957 1.1286 37.3314 69.0654 17.6314 12.5296 1.0670 0.2715 18.9017 43.0923 60.1014 0.3001 4.3059 27.5389 8.3071 0.2211 171.6940 14.7401 5.0732 726.2471 4.7437 0.0303 1.8880 55.5329
temp: 298.150 k
press: 1.00000 atm
elementType: 17 16 8 7 6 6 6 6 6 6 6 1 1 1 1
symmnumber: 1
zpe: 250761.8 jmol-1
zpe.correction: 0.095510 hartree
zpe.thermalcorrener: 0.104479 hartree
zpe.thermalcorrenthalpy: 0.105423 hartree
zpe.thermalcorrgfe: 0.060643 hartree
zpe.sumelectzpe: -1256.499300 hartree
zpe.sumelectthermal: -1256.490332 hartree
zpe.sumelectthermalent: -1256.489387 hartree
zpe.sumelectthermalfe: -1256.534167 hartree
dipole: 1.6311 3.0168 0.0000
dipole: 3.4295
quadrupole: -97.2772 -64.9982 -80.0128
quadrupole: -3.5722 0.0007 0.0005
quadrupole: -16.5145 15.7645 0.7500 -3.5722 0.0007 0.0005
hfenergy: -1256.59481 hartree
pointgroup: C01 [X(C7H4Cl1N1O1S1)]
dipole: 0.6568594 1.1785977 -0.0000055 debye
dipolederiv: -0.8240228 0.167597 0.0000061 0.2291018 -0.176965 -0.0000034 0.0000015 -0.0000011 -0.060725 -0.5983386 0.1465663 0.0000066 0.3555405 -0.2544655 -0.0000104 -0.0000238 0.00003 0.0433745 -1.7884975 0.1198734 -0.0000753 0.1611414 -0.4201856 -0.000009 0.0003356 -0.0000392 -0.3019526 -1.2182327 -0.1026613 0.0000388 -0.3684372 -0.5599608 0.0000273 -0.0000346 -0.0000393 -0.2953684 0.7349174 -0.1498302 -0.0000303 -0.4487593 -0.162824 -0.0000157 0.0000227 -0.0000168 0.0933319 0.4727696 0.2768346 -0.000014 0.5103759 0.082309 0.0000015 0.0000405 0.0000246 -0.1126141 0.0655045 0.0722579 0.0000087 -0.0353661 0.0830689 0.0000111 -0.0000268 0.0000136 -0.1681 -0.3203078 -0.0111163 0.0000058 -0.0579032 -0.0125986 0.0000027 -0.0000191 -0.0000123 -0.0540982 -0.3241824 0.0415491 -0.0000009 0.199473 -0.0322847 0.0000067 0.0000044 0.0000027 -0.1110963 1.1130982 -0.2696661 -0.0000083 -0.4219235 0.2008986 0.0000064 -0.0000075 0.0000069 -0.0845718 2.3405343 -0.2175808 0.0000692 -0.0852276 1.0655584 0.0000164 -0.0002977 0.0000739 0.1741844 0.1734306 -0.0617156 -0.0000088 -0.0339376 0.1805381 -0.0000158 0.0000053 -0.0000279 0.3590687 0.0476652 0.0601981 0.0000027 0.0343053 -0.0573695 -0.0000083 -0.0000009 -0.0000069 0.1796319 0.1084628 -0.0007864 0.0000013 0.0232588 0.0132509 -0.0000042 0.0000006 -0.000001 0.1684953 0.0171992 -0.0715199 -0.0000015 -0.061642 0.0510299 -0.0000053 -0.0000002 -0.0000073 0.1704398 unknown
polarizability: 183.0068569|-1.0605246|107.532625|-0.0008446|0.0013313|40.3030701 unknown
InChI: InChI=1S/C7H4ClNOS/c8-4-1-2-5-6(3-4)11-7(10)9-5/h1-3,9H
charge 0 multiplicity 1
15 atoms
Cl 4.007417 -0.760663 -0.000048
S  -1.596631 -1.672697 -0.00003
O  -3.875935 -0.035237 0.000086
N  -1.739612 0.989361 0.000007
C  -0.359485 0.715921 -0.000011
C  -0.076157 -0.678444 -0.000051
C  0.686656 1.661281 0.000036
C  1.248451 -1.149898 -0.000059
C  2.022028 1.200764 0.000012
C  2.278291 -0.186498 -0.000038
C  -2.632472 -0.08477 -0.000146
H  -2.121027 1.936952 0.000104
H  0.477796 2.735849 0.00008
H  1.477934 -2.218196 -0.000078
H  2.851645 1.912473 0.000039
