program: Gaussian 09
title: 000188420
version: EM64L-G09RevD.01
frameworkgroup: C1[X(C15H16N2)]
method: RPBEPBE
basis: SDD
operation: Freq
keyword: #pfreq=noraman
keyword: PBEPBE/SDD
title: #p freq=noraman PBEPBE/SDD
converged: NO YES NO NO
title: Mulliken charges:
elementType: N N C C C C C C C C C C C C C C C H H H H H H H H H H H H H H H H
charge: -0.111586 -0.121201 -0.239062 0.559552 -0.690181 -0.688834 -0.437637 -0.383276 -0.291309 -0.368417 0.153834 0.177317 -0.341685 -0.296678 -0.204620 -0.201220 -0.237383 0.211350 0.211064 0.214390 0.229140 0.229016 0.214263 0.211797 0.233770 0.233527 0.273182 0.247399 0.250333 0.274648 0.230551 0.227859 0.230098
chargesum: 0.00000
title: Mulliken charges with hydrogens summed into heavy atoms:
elementType: N N C C C C C C C C C C C C C C C
charge: -0.111586 -0.121201 -0.027712 0.559552 -0.035587 -0.033758 -0.203867 -0.149750 -0.018127 -0.121018 0.153834 0.177317 -0.091352 -0.022030 0.025930 0.026638 -0.007286
polarizability: 4.06159600e+02 -4.16938362e+00 1.63608471e+02 2.11507647e-01 4.58309670e-01 8.76349867e+01
1716.lowfreq: -20.0141 -9.8229 -4.4606 -0.0007 -0.0004 -0.0003 17.6585 30.4773 46.5650
frequency: 16.1672 30.4661 46.5545 57.9307 91.9443 139.8967 173.3751 180.7656 211.0283 245.6870 249.2958 281.3964 298.5682 320.0906 402.0083 407.3134 422.0274 446.5780 509.3297 512.2287 531.8023 568.4126 608.5035 620.1726 636.8041 692.5282 725.4405 753.1677 783.4918 818.3031 845.6884 853.3948 860.9674 888.5131 899.6795 918.1471 942.1835 954.6410 974.6794 986.1428 987.5135 991.4848 1001.5564 1001.5671 1014.4178 1049.7530 1074.9677 1103.9825 1109.6355 1137.4565 1152.7801 1157.5822 1169.9012 1186.7492 1217.3768 1235.2794 1285.7504 1304.7084 1306.5278 1321.5867 1358.4410 1376.7379 1388.4185 1392.3180 1396.2709 1421.3970 1444.0284 1463.7426 1465.9181 1467.9756 1477.9708 1479.4548 1492.5277 1571.8587 1583.5046 1603.3264 1611.2503 2976.6591 2979.2877 2980.1086 3070.2273 3077.5708 3080.7539 3084.8585 3121.1265 3127.7079 3127.9833 3139.0316 3152.0643 3158.2399 3164.5880 3164.9266 3171.6913
redmass: 3.1894 4.1632 3.5865 4.7296 4.5134 4.8277 3.2775 4.5002 1.0505 1.1227 5.4139 4.7689 3.2735 3.2631 3.1832 2.9609 3.9368 3.3694 3.1699 6.0500 3.9595 2.4857 6.4353 4.9784 5.7590 1.8649 4.2060 3.1629 1.8395 6.1242 1.2763 1.2493 1.5808 2.5660 7.2768 1.1790 1.4404 1.4664 1.3731 6.1758 1.3706 1.3655 2.3556 1.4392 2.0753 1.5559 1.4886 1.4271 2.5395 2.3011 1.7640 1.2540 1.0602 1.4880 1.8592 3.3779 1.5176 1.4119 1.3217 1.8822 6.4317 1.1916 4.5147 3.1101 1.4986 3.1818 2.4000 2.2083 1.0485 1.0473 1.0977 1.4664 1.4530 6.6648 6.2435 6.3074 6.4349 1.0348 1.0371 1.0822 1.1002 1.0993 1.1007 1.0999 1.0892 1.0853 1.0879 1.0886 1.0929 1.0954 1.0945 1.0958 1.1001
irintensity: 0.0527 0.8058 0.1854 1.4032 0.4660 0.0408 0.3880 0.0153 0.0295 0.0472 0.3569 0.9482 0.0701 0.4083 0.5499 0.0562 0.7086 7.1662 0.3935 5.4118 20.1504 37.9947 0.3933 3.7679 0.3209 55.2984 0.3002 5.8770 42.2355 0.0093 6.6895 0.5825 53.2897 3.8588 0.5549 3.7763 8.2350 0.0473 1.7616 0.7795 0.0091 0.3612 9.2826 2.6363 10.1454 55.1409 10.3672 19.2311 1.1913 0.9681 0.0617 56.8953 0.0989 1.2580 2.7309 29.7416 7.1403 0.2490 0.6750 16.5070 9.0727 15.0055 1.1493 4.9960 6.7648 11.0121 7.6838 6.7059 6.4389 0.1473 11.2804 8.0084 24.6745 3.6833 1.2378 0.7381 64.8974 30.5567 48.5404 22.4663 0.6416 111.2896 24.2547 42.8282 23.3534 4.6325 21.6039 9.7051 21.7347 13.2412 6.1465 19.0161 34.6590
temp: 298.150 k
press: 1.00000 atm
elementType: 7 7 6 6 6 6 6 6 6 6 6 6 6 6 6 6 6 1 1 1 1 1 1 1 1 1 1 1 1 1 1 1 1
symmnumber: 1
zpe: 707518.5 jmol-1
zpe.correction: 0.269480 hartree
zpe.thermalcorrener: 0.285125 hartree
zpe.thermalcorrenthalpy: 0.286070 hartree
zpe.thermalcorrgfe: 0.224371 hartree
zpe.sumelectzpe: -689.450512 hartree
zpe.sumelectthermal: -689.434866 hartree
zpe.sumelectthermalent: -689.433922 hartree
zpe.sumelectthermalfe: -689.495621 hartree
dipole: -0.9882 -0.0668 0.0059
dipole: 0.9905
quadrupole: -75.6153 -91.4216 -106.7263
quadrupole: 0.6759 0.0206 0.1115
quadrupole: 15.6391 -0.1672 -15.4719 0.6759 0.0206 0.1115
hfenergy: -689.7199918 hartree
pointgroup: C01 [X(C15H16N2)]
dipole: -0.3892857 0.0149995 0.009534 debye
polarizability: 405.4839943|11.3912788|163.7087289|-8.4451094|4.872247|88.2103346 unknown
InChI: InChI=1S/C15H16N2/c1-12(2)13-8-10-15(11-9-13)17-16-14-6-4-3-5-7-14/h3-12H,1-2H3
charge 0 multiplicity 1
33 atoms
N  0.801551 -0.512639 -0.029978
N  1.576545 0.541788 0.024115
C  -4.952796 0.263954 0.188975
C  -3.434997 0.084149 0.138645
C  -5.575596 -0.455302 1.415826
C  -5.624609 -0.21169 -1.128252
C  -2.568523 1.210793 0.201679
C  -2.850082 -1.205332 0.021338
C  -1.171162 1.069049 0.150584
C  -1.453015 -1.362352 -0.030945
C  -0.599312 -0.229074 0.03325
C  2.980319 0.252182 -0.041001
C  3.830573 1.388322 0.005262
C  3.542924 -1.052572 -0.14015
C  5.230743 1.228811 -0.049996
C  4.940381 -1.202884 -0.19401
C  5.789353 -0.066827 -0.15038
H  -5.157944 1.348362 0.296502
H  -5.420094 -1.548526 1.358425
H  -6.664933 -0.271419 1.457661
H  -5.125938 -0.099039 2.359681
H  -5.209263 0.318676 -2.003591
H  -6.714155 -0.027362 -1.093955
H  -5.469307 -1.295257 -1.284027
H  -3.007464 2.212332 0.291359
H  -3.491783 -2.092583 -0.029201
H  -0.503298 1.934548 0.200219
H  -0.992187 -2.35162 -0.12202
H  3.366945 2.377397 0.083888
H  2.868743 -1.913934 -0.1718
H  5.883495 2.107591 -0.014621
H  5.378479 -2.204573 -0.269999
H  6.876705 -0.194768 -0.194382
