program: Gaussian 09
title: 000188417
version: EM64L-G09RevD.01
frameworkgroup: C1[X(C18H10Cl4)]
method: RPBEPBE
basis: SDD
operation: Freq
keyword: #p
keyword: freq=noraman
keyword: PBEPBE/SDD
title: #p freq=noraman PBEPBE/SDD
converged: NO YES NO NO
title: Mulliken charges:
elementType: Cl Cl Cl Cl C C C C C C C C C C C C C C C C C C H H H H H H H H H H
charge: 0.028254 -0.008808 0.045801 0.015655 0.285777 0.266942 0.506800 -0.330803 -0.330788 0.264547 -0.366712 -0.366713 -0.268988 -0.322113 -0.384099 -0.383675 -0.088619 -0.235922 -0.099125 -0.218254 -0.218208 -0.239001 0.242924 0.242924 0.248501 0.248501 0.245319 0.245514 0.288560 0.227918 0.228007 0.229886
chargesum: 0.00000
title: Mulliken charges with hydrogens summed into heavy atoms:
elementType: Cl Cl Cl Cl C C C C C C C C C C C C C C C C C C
charge: 0.028254 -0.008808 0.045801 0.015655 0.285777 0.266942 0.506800 -0.087879 -0.087864 0.264547 -0.118212 -0.118212 -0.268988 -0.322113 -0.138780 -0.138161 -0.088619 0.052638 -0.099125 0.009664 0.009799 -0.009115
polarizability: 3.60771802e+02 2.57085244e+00 2.20217506e+02 -3.24450803e-04 -7.37237609e-03 1.22769829e+02
1716.lowfreq: -64.6635 -8.4656 -3.1001 -0.0014 -0.0010 -0.0009 5.4685 9.7483 24.9965
frequency: -64.6535 -6.5620 24.9930 28.9441 67.0040 74.5511 82.3814 122.7903 138.9125 170.9520 183.9887 206.3218 211.5470 217.0641 274.8489 297.8047 310.3325 343.2229 351.1612 383.9578 394.5405 397.8078 404.4811 500.0030 518.2098 524.4391 535.4129 557.5069 609.3643 609.9862 622.4206 637.6373 657.2228 705.8140 740.9396 742.4259 750.2178 767.7389 770.3624 823.0945 840.9504 847.1897 853.6280 859.0985 920.1613 957.8317 972.3542 974.0350 986.8097 994.6459 995.4330 998.1703 1023.6653 1043.1441 1077.5245 1106.9455 1110.9034 1159.5654 1172.3984 1186.7419 1191.4933 1252.1844 1286.1001 1298.1143 1308.7261 1317.7469 1335.7486 1340.1348 1368.2082 1394.5607 1408.3393 1428.0820 1474.4249 1510.7515 1530.7676 1559.8102 1568.1879 1582.9771 1610.4304 1622.3933 3122.4561 3128.1297 3131.7282 3132.7868 3140.2078 3149.2619 3151.9618 3157.4252 3164.2605 3183.2381
redmass: 3.7494 4.2922 9.0160 13.5494 10.8770 10.1972 6.5618 9.5897 11.2170 6.3953 25.3634 31.1970 10.8076 7.5962 6.1369 4.9117 24.7842 8.9379 22.8077 6.0712 2.8715 2.8265 8.0873 6.9458 6.4469 4.5294 3.3360 4.7832 8.9282 5.9536 4.5277 7.2158 7.2351 1.7334 6.8880 6.5136 4.2406 10.2054 2.0197 6.9730 1.7227 1.2455 1.2396 1.4122 1.4011 1.3389 1.3801 1.3792 6.2236 6.9454 1.3084 7.9507 2.6610 1.9374 1.6028 3.6185 1.4026 2.1495 1.0534 1.1147 1.1113 3.8050 2.8585 1.2650 1.3773 5.8878 11.6963 5.5068 6.6112 3.4030 3.6475 2.2113 2.2834 3.2795 10.0459 7.2619 9.5835 5.9807 6.2022 6.6398 1.0845 1.0877 1.0877 1.0879 1.0925 1.0969 1.0968 1.0980 1.1018 1.0933
irintensity: 0.0000 0.0084 0.0613 0.0422 0.0261 0.1347 0.0084 0.1630 0.3073 0.0002 0.2418 0.0118 0.3889 0.2817 2.2154 0.1218 0.2770 3.3034 0.2857 0.1431 0.0162 0.0016 0.9539 3.0035 13.9917 8.3970 9.7893 11.6480 0.1267 19.5758 22.8614 0.0585 40.4696 52.4342 5.3375 8.7439 1.6252 54.0721 40.4347 9.7308 23.9172 0.0208 0.0067 19.7917 1.6952 0.6179 0.0009 0.0022 0.1697 39.2175 0.1166 11.5618 4.6625 9.2209 8.1505 9.8816 7.5640 33.1506 0.0167 1.9103 0.0588 8.9977 0.8468 0.0001 1.0200 91.0988 4.2767 0.9250 0.0969 6.0179 143.9175 7.3062 17.3624 0.6593 27.4582 0.0014 35.5473 1.6314 8.5732 0.0303 2.5633 0.2441 0.0061 16.8163 17.1994 36.5434 20.3699 0.0262 26.4840 2.1306
temp: 298.150 k
press: 1.00000 atm
elementType: 17 17 17 17 6 6 6 6 6 6 6 6 6 6 6 6 6 6 6 6 6 6 1 1 1 1 1 1 1 1 1 1
symmnumber: 1
zpe: 572366.7 jmol-1
zpe.correction: 0.218003 hartree
zpe.thermalcorrener: 0.235741 hartree
zpe.thermalcorrenthalpy: 0.236686 hartree
zpe.thermalcorrgfe: 0.170131 hartree
zpe.sumelectzpe: -2530.646756 hartree
zpe.sumelectthermal: -2530.629018 hartree
zpe.sumelectthermalent: -2530.628074 hartree
zpe.sumelectthermalfe: -2530.694628 hartree
dipole: 1.9823 0.8563 0.0000
dipole: 2.1593
quadrupole: -145.1534 -151.6520 -151.8783
quadrupole: -5.4748 -0.0002 -0.0011
quadrupole: 4.4078 -2.0907 -2.3171 -5.4748 -0.0002 -0.0011
hfenergy: -2530.8647594 hartree
pointgroup: C01 [X(C18H10Cl4)]
dipole: -0.769665 0.3596522 0.0001536 debye
polarizability: 360.4994553|-6.6943379|220.4898405|-0.0247815|0.0322339|122.7698416 unknown
InChI: InChI=1S/C18H10Cl4/c19-14-10-15(20)17(21)18(22)16(14)13-8-6-12(7-9-13)11-4-2-1-3-5-11/h1-10H
charge 0 multiplicity 1
32 atoms
Cl 2.037792 -2.567249 -0.000812
Cl 1.82858 3.005043 0.000563
Cl 5.260026 -2.424431 -0.000985
Cl 6.720314 0.483453 -0.000498
C  0.566669 0.143931 -0.000023
C  -2.285289 0.021406 0.000252
C  2.064812 0.213403 -0.000151
C  -0.15031 0.114702 -1.221154
C  -0.149991 0.112721 1.221249
C  -3.785837 -0.046762 0.000392
C  -1.56039 0.054115 -1.219087
C  -1.560071 0.052148 1.219455
C  2.865829 -0.960343 -0.000475
C  2.760264 1.448839 0.000062
C  -4.563718 1.140697 0.001608
C  -4.4505 -1.301109 -0.000688
C  4.282349 -0.912467 -0.000585
C  4.164251 1.536675 -0.000051
C  4.918332 0.34964 -0.000372
C  -5.975958 1.075446 0.001741
C  -5.862681 -1.366577 -0.000554
C  -6.629883 -0.178528 0.000661
H  0.393494 0.138163 -2.172069
H  0.394068 0.134636 2.172055
H  -2.106341 0.030993 -2.168711
H  -2.105775 0.027497 2.169182
H  -4.058611 2.11347 0.002444
H  -3.857656 -2.223066 -0.001631
H  4.665729 2.507236 0.000132
H  -6.563258 2.000756 0.002685
H  -6.36196 -2.342188 -0.0014
H  -7.724582 -0.229351 0.000764
