program: Gaussian 09
title: 000188396
version: EM64L-G09RevD.01
frameworkgroup: C1[X(C22H30N4O2)]
method: RPBEPBE
basis: SDD
operation: Freq
keyword: #p
keyword: freq=noraman
keyword: PBEPBE/SDD
title: #p freq=noraman PBEPBE/SDD
converged: YES YES NO NO
title: Mulliken charges:
elementType: O O N N N N C C C C C C C C C C C C C C C C C C C C C C H H H H H H H H H H H H H H H H H H H H H H H H H H H H H H
charge: -0.273466 -0.254456 -0.089781 -0.463414 -0.409171 -0.063149 -0.357522 -0.361047 -0.390724 -0.398465 -0.399089 -0.482212 0.476854 -0.535379 -0.472737 0.368235 -0.215582 -0.385155 -0.370811 -0.185963 0.343793 -0.388580 0.202529 0.078419 -0.180914 -0.029798 -0.767885 -0.802306 0.209154 0.165471 0.173793 0.233602 0.190573 0.202036 0.206243 0.192266 0.189196 0.212803 0.192659 0.221460 0.285754 0.233589 0.221074 0.250619 0.214208 0.214393 0.246709 0.217743 0.300008 0.216914 0.294128 0.296018 0.254186 0.206294 0.254162 0.283598 0.215939 0.213187
chargesum: 0.00000
title: Mulliken charges with hydrogens summed into heavy atoms:
elementType: O O N N N N C C C C C C C C C C C C C C C C C C C C C C
charge: -0.273466 -0.254456 -0.089781 -0.169287 -0.113153 -0.063149 0.017103 0.046348 0.001885 0.000045 0.002910 -0.068093 0.476854 -0.249625 -0.239149 0.368235 0.005492 -0.134536 0.057790 0.060747 0.343793 0.129170 0.202529 0.078419 0.035999 -0.029798 -0.053244 -0.089583
polarizability: 3.60442189e+02 1.32805281e+01 2.79472846e+02 -4.72571496e+00 -1.20790558e+01 2.09096269e+02
1716.lowfreq: -74.4629 -8.4488 -2.6665 -0.0011 -0.0008 0.0006 3.5266 6.8098 10.4762
frequency: -74.4532 0.6229 9.1192 18.0406 21.0001 39.3275 43.3621 51.9809 56.5147 62.1263 77.7500 98.2371 124.2309 137.7930 152.7129 169.0984 188.8255 206.4042 216.6767 231.8388 237.3840 240.9818 268.9408 275.5020 285.3523 294.7312 308.1977 314.0480 322.8995 338.6003 380.2083 382.1743 407.3282 439.3581 445.1208 454.1552 466.3941 473.8851 520.5619 547.3024 556.8835 558.7406 562.7891 570.3408 590.5164 609.9336 632.7320 673.8544 690.6089 695.7397 734.5632 756.3984 758.0440 762.1864 779.4407 791.3399 803.1743 850.6777 854.5354 867.1088 880.1687 891.8763 906.7279 918.8461 937.4357 956.9037 958.8943 965.8282 976.0680 985.6594 986.7737 990.6152 991.1887 1000.9932 1013.4378 1021.0987 1028.8104 1047.1783 1050.7270 1081.0650 1090.3385 1113.9669 1120.5787 1121.8615 1127.8300 1130.1847 1135.2365 1149.1905 1157.6390 1176.0885 1184.0900 1192.5675 1197.4048 1225.2922 1236.5568 1240.4086 1250.2749 1262.6651 1265.7788 1267.7798 1281.3403 1289.1122 1294.5991 1295.4247 1325.6585 1328.8136 1336.6509 1338.8092 1348.0264 1353.2412 1363.7564 1365.1548 1383.5377 1385.8517 1395.1891 1409.6573 1442.2351 1444.8516 1450.8606 1455.2873 1456.9892 1457.9384 1459.7036 1465.0046 1465.8886 1467.7736 1471.9546 1474.7431 1479.7600 1479.8457 1486.4087 1515.9240 1562.0319 1587.6722 1612.3365 1619.9094 1652.7933 1696.9546 2814.5000 2823.5820 2843.4000 2941.6195 2957.3391 2965.4299 2966.2421 2982.7126 2983.3966 2984.6214 2985.4730 3007.2206 3011.4767 3017.0505 3032.7764 3039.0351 3041.3958 3044.5018 3053.6611 3070.5640 3079.3423 3094.5589 3096.6119 3120.6869 3121.5623 3142.1349 3158.6816 3166.6602 3529.3759 3559.2506
redmass: 1.0170 4.3394 4.9832 4.5494 3.8838 3.4496 4.9162 1.1420 3.3028 4.5147 4.2680 3.8753 4.4266 3.9447 2.9364 3.5271 4.1672 3.2926 2.8161 3.7953 2.2803 3.0592 2.6333 2.5262 3.0397 2.8542 3.4795 2.9124 2.5945 2.6292 1.7787 1.7107 3.0938 3.1830 2.8562 3.3229 3.2435 4.7404 7.3975 2.9685 1.3152 4.2892 2.5406 4.1303 5.0956 4.1200 3.8931 4.5008 8.7223 2.1806 3.6140 2.7582 5.8225 3.4997 2.0033 2.0734 1.4857 2.0991 1.6450 1.7974 2.3467 2.7489 2.5364 1.4754 2.3125 1.2901 2.1197 1.3655 4.1148 1.3149 1.4584 2.1396 3.3560 2.3942 2.0901 1.3978 1.9413 2.1215 1.5297 1.3970 1.8045 2.0719 2.9121 2.5293 2.5849 2.4270 2.2375 1.3085 2.3959 3.6948 1.1517 1.2983 1.2099 2.3881 2.5314 1.6485 1.5090 1.2349 1.4953 1.3135 1.4151 1.3541 1.2831 1.4590 2.2591 1.2892 1.4149 1.5030 1.5013 1.5088 1.4291 1.4806 1.9148 1.2845 2.9764 1.2299 3.0318 2.1591 1.0956 1.0441 1.1786 1.1024 1.0893 1.0923 1.0988 1.2133 1.4125 1.4478 1.1247 1.1350 1.0485 2.0497 5.6201 6.2177 4.9229 6.7090 8.1819 6.1815 1.0715 1.0712 1.0700 1.0567 1.0627 1.0378 1.0624 1.0370 1.0642 1.0782 1.0660 1.1048 1.0965 1.0869 1.0955 1.0979 1.0886 1.1028 1.1036 1.0981 1.0997 1.0967 1.0919 1.0865 1.0896 1.0932 1.0912 1.0960 1.0779 1.0772
irintensity: 0.1934 0.5239 2.4658 1.0473 6.2452 3.8116 0.5267 0.2677 1.2821 1.6529 0.9534 4.2794 0.0978 0.5597 1.8645 0.6939 3.2588 1.2785 0.4647 1.9112 1.5137 1.4593 5.6863 1.0660 2.0874 3.8494 1.2237 2.1997 0.5533 20.4284 29.9207 12.7089 8.5301 5.3948 1.2003 2.4988 2.3734 3.8287 6.2057 0.6561 143.7092 5.6472 20.1126 31.3945 5.9044 0.5765 15.4799 1.5538 0.6022 25.1653 16.1622 8.9386 20.4461 3.4730 49.1121 19.1488 0.5473 2.4634 8.6105 2.6763 6.7377 3.7521 24.2836 16.0270 5.1294 3.6729 26.8104 3.7759 80.9853 40.7526 28.6469 17.1165 75.4871 23.4799 22.6390 6.2568 6.9177 8.9294 0.4164 7.2366 23.9113 13.3049 0.6881 4.7307 15.0152 82.2909 51.6589 11.9444 35.2260 1.1114 2.9438 1.4448 11.2845 31.1638 152.2481 28.1545 61.0314 11.0428 167.9313 35.5209 53.8624 21.0903 9.2322 11.2874 6.5242 16.3277 14.8546 11.5074 4.8039 27.2612 6.8551 8.5826 17.3584 38.1976 3.3859 38.3087 63.2256 39.8449 8.1574 12.9438 51.1333 31.8392 9.0958 28.0141 7.0283 30.9944 15.0530 18.6217 3.5144 20.8388 24.8949 304.0102 575.0280 72.9977 361.2734 81.4689 179.5491 5.2845 54.5882 75.5777 194.5586 34.3045 68.1868 47.9943 41.1601 18.4999 40.3410 29.3185 10.8157 28.3520 37.6929 66.0455 70.2133 31.1880 26.9942 14.3455 102.2822 7.1718 20.3493 1.6419 27.0244 5.1941 22.8372 34.1429 0.8436 19.1176 15.8179 43.4579
temp: 298.150 k
press: 1.00000 atm
elementType: 8 8 7 7 7 7 6 6 6 6 6 6 6 6 6 6 6 6 6 6 6 6 6 6 6 6 6 6 1 1 1 1 1 1 1 1 1 1 1 1 1 1 1 1 1 1 1 1 1 1 1 1 1 1 1 1 1 1
symmnumber: 1
zpe: 1273909.1 jmol-1
zpe.correction: 0.485206 hartree
zpe.thermalcorrener: 0.512979 hartree
zpe.thermalcorrenthalpy: 0.513923 hartree
zpe.thermalcorrgfe: 0.418807 hartree
zpe.sumelectzpe: -1223.665972 hartree
zpe.sumelectthermal: -1223.638199 hartree
zpe.sumelectthermalent: -1223.637255 hartree
zpe.sumelectthermalfe: -1223.732371 hartree
dipole: 5.7427 5.6720 -0.1958
dipole: 8.0740
quadrupole: -214.0524 -151.1397 -162.6311
quadrupole: -37.8936 5.7173 -4.1819
quadrupole: -38.1113 24.8014 13.3099 -37.8936 5.7173 -4.1819
hfenergy: -1224.1511782 hartree
pointgroup: C01 [X(C22H30N4O2)]
dipole: -1.7765194 2.5020888 -0.8209826 debye
polarizability: 350.6164748|-24.1264985|287.0886513|22.5329504|-11.2329706|211.306178 unknown
InChI: InChI=1S/C22H30N4O2/c1-17-18(2)24-22(25-21(17)27)23-11-4-7-14-28-20-10-8-9-19(15-20)16-26-12-5-3-6-13-26/h4,7-10,15,23-24H,3,5-6,11-14,16H2,1-2H3
charge 0 multiplicity 1
58 atoms
O  -1.086423 -1.061563 -0.012074
O  7.513846 -2.334443 1.503722
N  -5.049623 2.047689 -0.837085
N  5.178913 0.789438 0.311672
N  3.811349 -0.720251 -0.892971
N  5.667052 -1.55464 0.295813
C  -5.6035 3.420123 -0.723468
C  -5.348606 1.442993 -2.160946
C  -5.034277 4.339425 -1.823063
C  -4.772531 2.301212 -3.304572
C  -5.307164 3.749236 -3.226012
C  -5.469048 1.178342 0.285528
C  -4.622633 -0.08528 0.427268
C  -3.241699 -0.054179 0.141639
C  -5.209222 -1.290699 0.894508
C  -2.447524 -1.212134 0.318148
C  -4.411764 -2.439777 1.075936
C  -3.026906 -2.417152 0.790638
C  -0.20459 -2.236227 0.189931
C  1.196926 -1.802316 -0.130679
C  6.281538 1.076959 1.140818
C  3.421967 -2.051693 -1.367696
C  4.916967 -0.528697 -0.079401
C  7.096647 0.045943 1.561699
C  1.990551 -2.42385 -1.038572
C  6.795643 -1.353973 1.13597
C  6.485653 2.528476 1.510267
C  8.296422 0.27779 2.451797
H  -5.345252 3.817375 0.276772
H  -6.724505 3.413665 -0.800434
H  -6.457309 1.332227 -2.304194
H  -4.911668 0.428858 -2.185313
H  -5.482437 5.34741 -1.728028
H  -3.942079 4.440664 -1.670862
H  -3.668278 2.308148 -3.221941
H  -5.033249 1.840191 -4.276654
H  -6.40082 3.747298 -3.416009
H  -4.844187 4.379622 -4.008733
H  -6.54804 0.883241 0.210054
H  -5.374667 1.77627 1.215086
H  -2.786666 0.867951 -0.233129
H  -6.283787 -1.326951 1.109497
H  -4.867335 -3.369706 1.435011
H  -2.431371 -3.324186 0.928462
H  -0.528315 -3.071742 -0.463713
H  -0.285361 -2.561263 1.249554
H  1.575008 -0.94584 0.442434
H  3.573576 -2.128272 -2.464773
H  4.137077 -2.756966 -0.898841
H  1.596579 -3.283949 -1.60103
H  4.577377 1.557255 0.007955
H  3.234771 0.074104 -1.172232
H  7.464771 2.892299 1.149482
H  5.702877 3.182564 1.085291
H  6.477366 2.658569 2.607346
H  8.790454 -0.692429 2.624431
H  8.010654 0.701784 3.434214
H  9.029753 0.969161 1.993486
