program: Gaussian 09
title: 000188394
version: EM64L-G09RevD.01
frameworkgroup: C1[X(C15H11BrN2O)]
method: RPBEPBE
basis: SDD
operation: Freq
keyword: #p
keyword: freq=noraman
keyword: PBEPBE/SDD
title: #p freq=noraman PBEPBE/SDD
converged: YES YES NO NO
title: Mulliken charges:
elementType: Br O N N C C C C C C C C C C C C C C C H H H H H H H H H H H
charge: -0.020624 -0.203245 -0.030731 -0.458159 0.323147 0.249221 0.270864 -0.092523 -0.099195 -0.379695 -0.319293 -0.304649 -0.308738 -0.253085 -0.267704 -0.233254 -0.231024 0.227752 -0.758488 0.234199 0.243613 0.315614 0.268422 0.267359 0.232537 0.231025 0.235550 0.234157 0.315604 0.311343
chargesum: 0.00000
title: Mulliken charges with hydrogens summed into heavy atoms:
elementType: Br O N N C C C C C C C C C C C C C C C
charge: -0.020624 -0.203245 -0.030731 -0.142545 0.323147 0.249221 0.270864 -0.092523 -0.099195 -0.145496 -0.075679 -0.036227 -0.041379 -0.020548 -0.036679 0.002297 0.003133 0.227752 -0.131541
polarizability: 2.46287490e+02 2.29001340e+01 2.97229573e+02 3.21410782e+00 -1.83996687e+00 9.64781202e+01
1716.lowfreq: -2.8539 0.0004 0.0005 0.0005 5.6689 7.9682 21.9366 49.0082 64.7262
frequency: 21.8925 48.9177 64.7173 74.9162 88.5507 106.0480 120.6517 192.6473 235.0900 245.0017 289.0298 313.7842 322.4634 394.6072 405.7922 434.1383 445.8989 475.1633 502.1264 538.4547 551.6019 585.1493 597.4717 609.4781 625.9792 643.4094 659.5805 668.8411 719.9950 749.1904 766.6390 771.9808 800.5546 840.2991 860.5167 870.0827 871.5295 878.3918 907.5626 955.7980 965.6962 968.5863 996.2372 997.3611 1018.2759 1021.8493 1075.1414 1111.6254 1140.8981 1149.5805 1161.9824 1183.4538 1217.0104 1226.8927 1238.3383 1253.9113 1286.4062 1297.9943 1353.4420 1369.5608 1394.9548 1413.7872 1425.4331 1443.0472 1457.8612 1478.3761 1485.8142 1527.4515 1551.1139 1562.0799 1611.8721 1615.5771 1634.7140 3067.1785 3127.3646 3135.8487 3141.2256 3152.0553 3152.5273 3157.6381 3171.6558 3173.1546 3186.0973 3445.5389
redmass: 8.6846 6.3871 7.3032 3.0659 5.1066 6.5903 4.5026 5.8645 4.8642 5.0737 5.7586 8.8808 6.2740 6.8323 3.4740 5.3692 6.5615 2.8644 3.2758 3.6317 4.9045 3.7644 5.8182 3.1898 6.0780 5.7603 5.2142 1.4325 4.7244 3.4468 1.4766 1.3799 2.6943 5.3630 6.0958 1.6209 1.7093 1.9884 6.6400 4.9828 1.3896 1.4316 1.3330 1.3313 2.2841 2.0438 5.5863 2.0129 1.1336 1.3556 1.1863 1.1755 1.7426 1.2979 1.6524 2.8160 1.6487 5.5710 2.9313 2.2235 2.7947 1.0994 6.9784 2.7739 3.2139 2.2686 2.8885 6.9341 7.6288 5.0458 6.2829 7.5369 6.4262 1.0571 1.0860 1.0864 1.0894 1.0906 1.1081 1.0951 1.0973 1.0997 1.0959 1.0760
irintensity: 0.1381 1.2722 2.7606 5.2857 6.8391 3.1373 2.2494 2.0602 0.4219 0.2765 1.0433 0.7555 0.5127 2.6809 5.2686 0.7222 28.3438 0.4763 0.1180 1.7034 2.3443 0.4128 2.0068 2.6879 77.0139 24.8951 21.6787 94.3119 12.5070 0.7059 108.3193 29.2683 7.0137 3.0019 1.1821 4.1197 12.2876 5.5179 1.3002 3.2537 0.5246 1.0513 0.4148 0.5627 1.5780 11.9909 1.4269 0.0192 4.1039 13.6737 1.7538 0.1719 12.7549 18.9961 28.8711 1.7574 0.1011 7.2597 14.7735 13.7220 0.6125 43.5546 54.5124 28.2757 0.5926 250.5951 225.6536 31.3839 20.0114 29.6673 65.9823 109.2608 2.7223 1.5798 0.6664 5.7503 10.7331 13.1609 0.0300 19.9812 22.8647 24.5423 18.0851 90.4076
temp: 298.150 k
press: 1.00000 atm
elementType: 35 8 7 7 6 6 6 6 6 6 6 6 6 6 6 6 6 6 6 1 1 1 1 1 1 1 1 1 1 1
symmnumber: 1
zpe: 584977.2 jmol-1
zpe.correction: 0.222806 hartree
zpe.thermalcorrener: 0.238357 hartree
zpe.thermalcorrenthalpy: 0.239301 hartree
zpe.thermalcorrgfe: 0.177569 hartree
zpe.sumelectzpe: -775.102418 hartree
zpe.sumelectthermal: -775.086868 hartree
zpe.sumelectthermalent: -775.085923 hartree
zpe.sumelectthermalfe: -775.147656 hartree
dipole: 1.6732 0.5341 -1.3674
dipole: 2.2259
quadrupole: -117.5559 -101.4055 -127.8846
quadrupole: 1.6239 2.6418 5.3027
quadrupole: -1.9406 14.2098 -12.2693 1.6239 2.6418 5.3027
hfenergy: -775.3252245 hartree
pointgroup: C01 [X(C15H11Br1N2O1)]
dipole: -0.5724279 -0.0691982 0.6591308 debye
polarizability: 271.1707671|-35.1106576|267.6420685|-27.2510811|-4.0465992|101.1823471 unknown
InChI: InChI=1S/C15H11BrN2O/c16-9-14(19)18-15-10-5-1-3-7-12(10)17-13-8-4-2-6-11(13)15/h1-8,18H,9H2
charge 0 multiplicity 1
30 atoms
Br -4.12535 -2.117019 1.645795
O  -1.095782 -2.674432 -1.240811
N  1.905688 1.636325 -0.180531
N  -1.335646 -1.118839 0.514815
C  -0.23819 -0.234476 0.247954
C  -0.518399 1.160004 0.122368
C  1.103985 -0.703248 0.163457
C  0.609794 2.065634 -0.075506
C  2.150235 0.29298 -0.073994
C  -1.846589 1.714163 0.168201
C  1.491553 -2.078453 0.333628
C  0.3608 3.479433 -0.178267
C  3.518932 -0.141637 -0.175878
C  -2.047625 3.088012 0.060618
C  2.826905 -2.456208 0.242394
C  -0.934131 3.981493 -0.105634
C  3.851253 -1.48262 -0.024854
C  -1.712479 -2.216602 -0.235451
C  -2.981087 -2.96825 0.186042
H  -2.712448 1.049388 0.263076
H  0.726064 -2.834569 0.52033
H  -1.994899 -0.835095 1.249735
H  1.23094 4.127455 -0.319822
H  4.271255 0.629421 -0.366356
H  -3.064305 3.494629 0.091394
H  3.105066 -3.50782 0.37057
H  -1.114499 5.058806 -0.186151
H  4.895169 -1.805447 -0.101718
H  -3.643963 -3.067783 -0.685408
H  -2.715047 -3.963741 0.573799
