program: Gaussian 09
title: 000188389
version: EM64L-G09RevD.01
frameworkgroup: C1[X(C8H12FNO4)]
method: RPBEPBE
basis: SDD
operation: Freq
keyword: #p
keyword: freq=noraman
keyword: PBEPBE/SDD
title: #p freq=noraman PBEPBE/SDD
converged: NO YES NO NO
title: Mulliken charges:
elementType: F O O O O N C C C C C C C C H H H H H H H H H H H H
charge: -0.206771 -0.274708 -0.252271 -0.428905 -0.426407 -0.070586 -0.311734 -0.184054 -0.036212 -0.099048 -0.096400 -0.366007 0.242578 -0.743489 0.287248 0.294446 0.228195 0.268421 0.286411 0.192636 0.232815 0.356208 0.258526 0.245665 0.247537 0.355906
chargesum: 0.00000
title: Mulliken charges with hydrogens summed into heavy atoms:
elementType: F O O O O N C C C C C C C C
charge: -0.206771 -0.274708 -0.252271 -0.072697 -0.070501 -0.070586 -0.024486 0.110392 0.191983 0.169373 0.190010 0.059445 0.242578 0.008239
polarizability: 1.05745847e+02 -6.41333028e+00 1.03033783e+02 4.13201939e+00 -1.11192166e+00 9.02348524e+01
1716.lowfreq: -8.5663 -5.2735 -0.0009 -0.0006 0.0001 1.9163 37.8491 80.7791 97.5608
frequency: 37.7681 80.7436 97.5541 105.0556 124.5412 149.4839 190.2555 208.2937 255.8517 274.5313 299.4267 348.4956 406.9680 430.3392 438.3239 455.4671 461.9812 485.0200 531.8619 541.8353 588.5071 673.4988 689.0946 760.7684 808.0646 824.9863 839.4843 884.6055 914.9705 947.4415 959.0271 973.8735 983.8944 1013.7420 1025.4917 1049.1521 1052.7854 1077.6263 1104.1824 1156.2405 1191.6815 1199.9484 1209.5338 1221.8282 1245.6741 1256.2600 1271.3889 1298.5980 1309.2575 1328.2095 1338.0513 1349.1475 1355.4262 1372.5371 1389.4645 1398.3070 1454.1814 1457.2533 1460.1438 1649.2774 2951.7567 3004.3199 3029.6594 3041.6883 3044.3549 3082.8508 3085.8527 3102.7556 3121.0905 3140.6041 3509.9009 3549.3528
redmass: 6.8474 4.1867 3.3753 2.9575 1.4266 5.3559 5.4893 3.0950 5.5924 6.3895 3.7881 4.8093 3.0690 5.7770 1.3810 2.4725 1.3420 5.3710 5.2503 4.1702 4.7006 5.6308 4.9418 3.3129 5.5341 4.9776 3.5737 6.2527 3.4780 3.4712 4.8385 4.0591 3.1913 4.6118 2.8756 2.0891 1.8749 2.2978 2.5263 1.8504 1.3094 1.7243 1.4459 1.8353 1.3889 1.3237 1.5121 1.2766 1.2450 1.3143 1.1987 1.2913 1.2576 1.3828 1.3587 1.2723 1.0446 1.0633 1.0840 8.8794 1.0693 1.0378 1.0859 1.0843 1.0859 1.0944 1.0974 1.0871 1.0902 1.0994 1.0658 1.0656
irintensity: 0.7099 1.5350 4.2285 1.5599 0.3849 0.0481 2.9428 0.0238 13.4783 19.4397 2.4910 6.8111 15.3937 3.5222 138.3275 50.8593 119.0239 13.3912 0.7760 17.6273 7.3251 8.5787 12.4933 7.3003 78.4691 76.3599 45.7124 61.0906 26.2988 31.7891 43.6432 101.2764 70.0435 99.4664 9.6777 5.4329 5.1771 10.7151 9.9598 12.6597 11.1119 71.9059 27.6847 19.3313 10.0044 1.6353 22.6514 5.7323 7.0932 7.3325 2.5267 9.0391 30.4513 3.5214 23.8685 33.4217 19.0165 24.9048 4.1539 113.3042 51.0943 5.9216 14.7325 13.4266 16.1220 14.3827 7.3708 5.7725 15.2719 4.9987 9.0618 9.9583
temp: 298.150 k
press: 1.00000 atm
elementType: 9 8 8 8 8 7 6 6 6 6 6 6 6 6 1 1 1 1 1 1 1 1 1 1 1 1
symmnumber: 1
zpe: 530373.9 jmol-1
zpe.correction: 0.202009 hartree
zpe.thermalcorrener: 0.215512 hartree
zpe.thermalcorrenthalpy: 0.216456 hartree
zpe.thermalcorrgfe: 0.161817 hartree
zpe.sumelectzpe: -766.404976 hartree
zpe.sumelectthermal: -766.391472 hartree
zpe.sumelectthermalent: -766.390528 hartree
zpe.sumelectthermalfe: -766.445167 hartree
dipole: 0.9820 -0.1964 -2.0203
dipole: 2.2549
quadrupole: -78.4322 -94.1326 -81.9953
quadrupole: -7.8948 -0.0533 -2.1941
quadrupole: 6.4211 -9.2792 2.8581 -7.8948 -0.0533 -2.1941
hfenergy: -766.6069845 hartree
pointgroup: C01 [X(C8H12F1N1O4)]
dipole: -0.4520802 -0.2853593 0.7079854 debye
dipolederiv: -0.26896 0.0224308 -0.054486 -0.0151551 -0.3198739 0.0562617 0.0535464 0.0848653 -0.7081223 -1.0707843 -0.0013118 0.0892652 0.0605605 -0.4848203 -0.0104357 0.3386627 0.0076499 -0.5244314 -0.7847569 0.0861767 -0.2987591 -0.2106037 -0.6053204 -0.0159809 -0.5614629 0.2196075 -0.6988363 -0.6197371 -0.2123506 -0.0247851 -0.1536845 -0.3258474 -0.159148 -0.0182746 -0.1913507 -0.6464985 -0.5718495 0.0684435 -0.1710242 0.1248929 -0.7681543 0.078779 -0.2062971 0.1347347 -0.2707318 -0.4711218 -0.1053609 -0.0918462 -0.0219323 -0.7672191 -0.0219598 -0.0813101 -0.0317563 -0.3468088 0.0896525 0.0054092 -0.0293185 -0.0104955 0.0641802 0.0610601 -0.0043838 0.0889143 0.0857647 0.3904254 0.1835766 0.1128905 0.1246772 0.2943853 0.0514043 0.0266259 0.1122714 0.3890724 0.252789 0.0721921 0.0710039 0.0645569 0.3394149 -0.0710257 0.0343911 -0.1135754 0.634571 1.2030247 0.0466917 -0.0325885 0.244964 0.3222678 0.141623 0.0488712 -0.0098373 0.4469171 0.2902478 0.0369778 -0.1165419 0.0406645 0.0968262 0.0428079 -0.3255657 -0.0249772 0.3408974 0.3267037 -0.030927 0.092877 -0.039407 0.6291469 -0.0371666 0.0959244 -0.0541418 0.2766144 0.4849634 -0.0127263 0.4389054 -0.0709032 0.9788708 -0.0786597 0.599909 -0.1148284 0.6672383 -0.0278078 -0.0570662 -0.0997931 -0.1118508 -0.1314797 -0.1302151 -0.119639 -0.0714992 -0.0685868 -0.0075794 0.019139 0.0615462 0.0490595 0.040491 -0.0494887 0.0263105 -0.0944698 -0.0097027 0.049714 0.036564 -0.0291213 0.0355584 -0.0251631 0.0418439 -0.009918 0.0205853 0.0346081 -0.0962875 -0.1005647 -0.0202778 -0.0677536 0.0323701 0.00421 -0.016966 -0.004934 0.0018741 -0.0079343 0.0092015 0.0136871 -0.0149202 0.0704836 0.0218852 0.0178698 0.0136817 -0.0802997 0.0114972 -0.0526511 -0.0681876 -0.0546908 0.0172293 -0.0231608 0.0021073 -0.0113825 -0.0252955 -0.0042642 -0.039434 -0.0543524 -0.0560302 -0.1250468 -0.0763092 -0.1216903 -0.1058627 -0.0330546 0.0517807 -0.0136626 0.0451871 0.009072 0.040173 0.0272397 0.0734089 0.0650826 -0.0549531 0.3127185 0.0887365 -0.0220839 0.0969304 0.1534332 0.1213514 -0.0230034 0.0983193 0.3123996 0.0833804 0.0189659 -0.0576348 0.0583067 0.0441676 0.089897 -0.0737628 0.0373941 0.0327101 0.0219001 -0.0966323 0.0313584 -0.0798539 0.0637172 0.0299447 0.0778549 0.0449005 0.0380549 0.0193813 0.0898765 0.0598672 0.061269 0.0398995 -0.0591615 0.0079965 -0.0737636 0.0734149 0.3429042 -0.0616943 0.1542122 -0.0632313 0.3258682 -0.0355963 0.1587949 -0.0256276 0.1331845 unknown
polarizability: 103.1477422|5.0602776|103.0975466|6.5204691|4.9206062|92.7691937 unknown
InChI: InChI=1S/C8H12FNO4/c1-3-10-6-7(12)5(9)4(2-11)14-8(6)13-3/h4-8,11-12H,2H2,1H3
charge 0 multiplicity 1
26 atoms
F  0.680068 1.307084 -1.942458
O  0.716289 -0.568655 1.193904
O  -1.463288 -1.44086 0.577192
O  0.572856 2.399903 1.575596
O  2.726091 -2.234652 -0.004836
N  -2.064358 0.565806 -0.460688
C  -1.233676 0.947084 0.723462
C  -0.054244 1.874909 0.349989
C  1.027481 1.195976 -0.522584
C  -0.719727 -0.402216 1.341437
C  1.194695 -0.304865 -0.20227
C  2.64285 -0.794583 -0.222577
C  -2.151584 -0.733635 -0.470796
C  -2.89255 -1.603942 -1.429977
H  -1.868669 1.493517 1.44205
H  -0.438098 2.757518 -0.18359
H  1.97038 1.760695 -0.392334
H  -0.915759 -0.566726 2.409067
H  0.586943 -0.906027 -0.903466
H  3.231755 -0.233272 0.535935
H  3.080068 -0.614195 -1.21893
H  0.981248 1.636993 2.065634
H  -3.375056 -0.980099 -2.195836
H  -3.660007 -2.195334 -0.899908
H  -2.205108 -2.318841 -1.915568
H  2.2268 -2.442082 0.827054
