program: Gaussian 09
title: 000188383
version: EM64L-G09RevD.01
frameworkgroup: C1[X(C9H9ClN2O4)]
method: RPBEPBE
basis: SDD
operation: Freq
keyword: #p
keyword: freq=noraman
keyword: PBEPBE/SDD
title: #p freq=noraman PBEPBE/SDD
converged: YES YES NO NO
title: Mulliken charges:
elementType: Cl O O O O N N C C C C C C C C C H H H H H H H H H
charge: 0.010717 -0.273915 -0.423059 -0.256351 -0.235772 -0.178353 -0.406462 -0.074074 -0.098192 -0.135881 -0.158622 -0.328238 0.248156 0.006600 -0.317698 0.156054 0.289384 0.223032 0.275645 0.221120 0.215587 0.257141 0.364575 0.258351 0.360254
chargesum: 0.00000
title: Mulliken charges with hydrogens summed into heavy atoms:
elementType: Cl O O O O N N C C C C C C C C C
charge: 0.010717 -0.273915 -0.062806 -0.256351 -0.235772 -0.178353 -0.041887 0.215310 0.124840 -0.135881 0.117023 0.108470 0.248156 0.263741 -0.059347 0.156054
polarizability: 1.77137998e+02 5.61663475e+00 9.98697995e+01 3.17818792e+00 1.67878094e+00 1.18876322e+02
1716.lowfreq: -7.1210 -3.3221 0.0005 0.0008 0.0022 5.6097 32.2583 34.2692 47.2418
frequency: 32.2085 34.2664 47.2256 77.9257 113.8719 119.7382 166.7714 174.6847 187.0886 257.8590 289.7510 301.6725 368.5749 382.8992 404.7858 419.0700 429.8323 506.3710 515.0049 554.4601 596.2032 634.4603 686.5745 703.1217 735.8674 744.5640 771.8417 789.3901 810.0399 818.9643 851.2420 858.0294 873.3458 938.7049 940.1645 951.6635 954.1428 1020.7644 1042.7959 1058.7823 1094.1071 1155.1213 1167.9682 1208.6302 1224.7632 1248.3751 1262.1449 1275.4023 1306.1564 1322.8384 1345.9710 1363.7287 1374.7481 1379.3777 1434.3097 1458.2673 1606.6477 1645.2036 1651.1100 1672.4332 2965.4385 2982.3568 3049.6964 3077.9307 3167.6552 3204.4547 3215.8745 3521.7679 3552.0629
redmass: 7.4710 6.4487 8.8250 8.8902 5.8604 6.1426 6.1400 5.1190 7.1659 4.7008 3.9052 7.0775 5.9471 3.6548 4.0046 5.2500 1.4380 4.2967 6.6693 7.9378 6.1700 5.2132 3.4143 2.1766 4.6871 8.0744 1.8445 3.1911 1.9997 4.5165 5.0808 1.9108 3.0357 1.9945 3.1455 1.8561 2.5261 2.9276 2.0914 2.2430 2.3807 1.8563 1.7362 2.7235 1.2881 1.5493 1.4268 1.9410 1.6007 3.4203 1.3209 1.5502 1.3544 1.4383 2.2147 1.0815 5.7802 8.5105 11.0914 5.9778 1.0751 1.0754 1.0855 1.0973 1.0910 1.0985 1.0974 1.0770 1.0654
irintensity: 1.1107 2.2544 0.7752 3.2416 2.5549 0.7089 3.8110 7.9754 7.8686 9.0059 2.1662 6.9231 10.3077 28.2607 14.9923 70.4906 135.4063 47.3554 7.6312 19.4220 8.4997 16.1594 11.8269 14.6750 3.7114 14.8289 38.1363 9.0933 91.6894 45.5480 72.3006 58.1239 16.7848 44.4889 7.6900 59.3827 105.9041 49.0326 51.7090 22.7378 20.7115 74.4938 52.3826 75.2103 29.0882 96.5399 25.7284 6.8450 5.8888 140.6428 18.2505 19.4658 13.1656 2.7307 97.8867 5.6459 27.9162 34.1926 246.5869 780.0587 8.3086 92.9056 13.2150 20.3503 3.6717 0.8780 0.4000 62.8261 5.7825
temp: 298.150 k
press: 1.00000 atm
elementType: 17 8 8 8 8 7 7 6 6 6 6 6 6 6 6 6 1 1 1 1 1 1 1 1 1
symmnumber: 1
zpe: 467137.3 jmol-1
zpe.correction: 0.177923 hartree
zpe.thermalcorrener: 0.192533 hartree
zpe.thermalcorrenthalpy: 0.193477 hartree
zpe.thermalcorrgfe: 0.134252 hartree
zpe.sumelectzpe: -1217.620527 hartree
zpe.sumelectthermal: -1217.605918 hartree
zpe.sumelectthermalent: -1217.604974 hartree
zpe.sumelectthermalfe: -1217.664199 hartree
dipole: -3.7122 0.2998 -3.7129
dipole: 5.2589
quadrupole: -122.1593 -100.6390 -96.9517
quadrupole: 2.9548 13.5032 0.1510
quadrupole: -15.5760 5.9443 9.6317 2.9548 13.5032 0.1510
hfenergy: -1217.7984506 hartree
pointgroup: C01 [X(C9H9Cl1N2O4)]
dipole: -1.4593768 -1.3340518 -0.6093527 debye
dipolederiv: -0.1184967 -0.117754 0.0927974 -0.1575681 -0.2160798 0.2579459 0.1410429 0.2976083 -0.4812332 -1.0888241 -0.1482735 0.0115843 -0.4429759 -0.4622716 0.0920389 0.2134029 0.0780932 -0.4622873 -0.4605073 0.0571742 0.2830398 0.2101971 -0.6397391 -0.0763754 0.3192865 -0.0285616 -0.4879265 -0.6369107 0.1374411 0.0335839 0.1680843 -1.0442045 -0.367342 0.0453554 -0.3771981 -0.5602454 -1.3744557 0.2536232 -0.0229375 0.1151364 -0.4796124 -0.051424 -0.1110351 -0.0254754 -0.395072 -1.3813179 -0.2600703 -0.2289358 0.7134251 -0.8603631 -0.2832989 0.136126 -0.4464037 -0.4329297 -0.9947039 0.4139332 0.1366786 0.4870204 -0.7337343 -0.1487421 0.1662308 -0.1547937 -0.4010532 1.8328555 -0.0008194 0.1258987 -0.0237961 0.2812552 -0.0594469 -0.3571829 -0.1200863 0.333874 0.4611923 0.104077 0.0532233 0.1635094 0.3753067 -0.0166301 0.2509695 0.0458229 0.1645113 -0.0313574 0.2847081 -0.1710833 0.2367856 0.3006253 -0.4197698 -0.0699228 -0.4566598 0.6292881 -0.1904491 0.0268011 0.0926348 0.0333242 -0.1963676 0.0230076 -0.1000181 0.0590906 -0.1634318 0.3538616 -0.0071853 -0.1387825 -0.1523303 0.5366174 0.0583014 -0.1208364 0.0586732 0.3261234 1.3358121 -0.0467652 0.1370301 -0.087312 1.4065153 0.6134537 0.1517415 0.6362668 0.6897325 0.6567334 -0.2409887 -0.0242454 -0.8412233 0.4862356 0.1443402 -0.3531249 0.2238105 0.0944156 -0.8846036 0.0578582 -0.0774594 -0.1471436 -0.1465278 0.0161118 -0.2043432 0.0613834 -0.233576 1.7689608 -0.354509 0.0438273 -0.1768968 0.8710361 0.3195425 0.1643854 0.2840057 0.4651942 0.0911063 -0.0357852 0.0223733 0.0744175 0.0347966 0.040691 0.0562158 -0.0060283 0.0812866 0.0179662 0.04864 -0.0030489 -0.0370326 -0.1777352 0.0105316 0.0110443 0.0163307 0.0167837 0.1034904 -0.0395712 -0.0619749 -0.0541246 0.1462894 -0.0033633 -0.0538791 0.0017652 0.040523 0.0372676 0.0370829 0.0043322 0.0362965 -0.0586752 0.0732374 0.0581173 0.1339071 -0.1348315 -0.0536992 -0.0732135 -0.0536842 -0.0260517 0.010357 -0.0495005 -0.0880452 -0.0867924 0.0401725 0.0699291 -0.0837947 -0.0481618 -0.0677781 0.0675942 -0.0515717 -0.0337553 -0.0446916 0.1026076 0.1952718 0.0416608 -0.0009954 0.0688613 0.2075841 -0.0621322 0.0135393 -0.0643341 0.3001074 0.0696106 0.0257977 -0.0030021 0.0060103 0.0484504 -0.0769316 -0.0153394 -0.0754567 0.1388026 0.2212679 -0.0800677 -0.2026924 -0.0988348 0.2426475 0.0173263 -0.2199753 -0.0102761 0.329164 unknown
polarizability: 177.4134962|3.9993575|117.9120494|-2.205824|4.4615456|100.558574 unknown
InChI: InChI=1S/C9H9ClN2O4/c10-6-3-5(4-13)16-8(6)12-2-1-7(14)11-9(12)15/h1-3,5,8,11,13H,4H2
charge 0 multiplicity 1
25 atoms
Cl -0.980726 1.30368 -2.6711
O  -1.495119 -0.403686 0.982966
O  -4.225312 0.526561 1.050981
O  1.209627 2.107077 1.257713
O  4.672088 -0.838306 0.159165
N  0.67191 0.165092 0.024113
N  2.90552 0.602154 0.676045
C  -0.764243 0.509771 0.074954
C  -2.564754 -1.136691 0.21874
C  -1.488691 0.3386 -1.248951
C  -2.477828 -0.577798 -1.185235
C  -3.898325 -0.888167 0.958869
C  1.577166 1.039777 0.70019
C  1.106098 -1.021934 -0.567465
C  2.417583 -1.416789 -0.563833
C  3.436964 -0.591818 0.087244
H  -0.803078 1.534823 0.48402
H  -2.341311 -2.224125 0.245985
H  -3.148059 -0.875022 -1.993071
H  -3.827433 -1.357889 1.962063
H  -4.728577 -1.356721 0.403137
H  0.322097 -1.615468 -1.045698
H  3.579444 1.216158 1.145577
H  2.735862 -2.343952 -1.040451
H  -3.498104 0.972073 1.557542
