program: Gaussian 09
title: 000017346
version: EM64L-G09RevD.01
frameworkgroup: C1[X(C19H13F)]
method: RPBEPBE
basis: SDD
operation: Freq
keyword: #pfreq=noraman
keyword: PBEPBE/SDD
title: #p freq=noraman PBEPBE/SDD
converged: NO YES NO YES
title: Mulliken charges:
elementType: F C C C C C C C C C C C C C C C C C C C H H H H H H H H H H H H H
charge: -0.203163 0.368443 0.074847 0.137634 0.251101 0.112843 0.481228 -0.787526 0.508228 0.143081 -0.690070 -0.795639 -0.400178 -0.336643 -0.461074 -0.449040 -0.260814 -0.249945 -0.263233 -0.251536 0.231573 0.256720 0.220242 0.249033 0.249043 0.226714 0.222597 0.247232 0.247340 0.228456 0.231794 0.229045 0.231668
chargesum: 0.00000
title: Mulliken charges with hydrogens summed into heavy atoms:
elementType: F C C C C C C C C C C C C C C C C C C C
charge: -0.203163 0.368443 0.074847 0.137634 0.251101 0.112843 0.481228 -0.555953 0.508228 0.143081 -0.433350 -0.077321 -0.173464 -0.114046 -0.213842 -0.201700 -0.032358 -0.018151 -0.034188 -0.019868
polarizability: 3.88804830e+02 -9.67673176e-02 2.31743655e+02 -6.38624491e-03 -3.71814503e-03 8.10837057e+01
1716.lowfreq: -8.9821 -0.0009 -0.0006 0.0009 3.7274 6.0610 22.3653 58.3524 73.0467
frequency: 21.5699 58.3505 73.0348 121.8539 167.6697 168.3503 175.8101 274.0404 276.4963 282.8478 313.6497 317.5464 341.0536 382.9537 426.3795 428.3710 458.3100 486.3827 502.4372 517.2282 529.0381 580.9356 587.8535 594.1718 596.6866 638.5140 651.8616 661.0176 729.0939 753.7271 759.0182 776.7548 788.6434 816.8719 852.5122 862.5021 863.0947 883.3842 902.8178 903.6841 933.5686 957.0629 966.0521 989.0747 990.8946 1014.2519 1024.9272 1037.9606 1040.7355 1054.2165 1082.6404 1111.3443 1153.6333 1173.4183 1180.9748 1190.1908 1229.1476 1257.3469 1259.9591 1283.2334 1321.0793 1340.8075 1361.0801 1385.1620 1397.2577 1404.2260 1411.0951 1434.6082 1437.9570 1452.1660 1471.0864 1475.8022 1493.9495 1507.2038 1549.0474 1567.2038 1594.6742 1617.9001 1627.8827 1634.2051 3011.5558 3084.2520 3122.0134 3126.2540 3129.1613 3136.6832 3136.9837 3148.0108 3156.6192 3157.3752 3160.1488 3169.4413 3174.5054
redmass: 3.1929 4.3608 3.8056 4.5363 2.0353 5.3187 1.6608 3.8862 9.7720 4.3590 5.8873 4.3023 4.7764 4.0123 8.3996 3.0943 3.6469 6.1741 4.7925 2.9082 3.1512 6.8292 3.4244 5.5948 3.5477 6.3766 6.2404 6.0475 3.9519 1.3332 1.3503 4.2298 2.4341 2.0128 1.3874 1.5355 4.0049 5.1335 1.8209 5.7182 2.2568 1.4068 1.4402 1.3490 1.3614 3.1246 2.9975 1.6012 2.6422 3.1509 1.9485 2.1564 1.6138 1.2133 1.1185 1.2976 1.5598 1.9601 1.9449 2.4582 2.5258 3.6378 2.7711 3.8468 2.2827 4.2493 1.3028 2.8625 5.7613 2.7666 1.7295 1.0445 2.0259 2.3359 5.8460 7.5618 5.5875 6.2323 6.6055 7.4422 1.0403 1.0971 1.0867 1.0861 1.0955 1.0894 1.0898 1.0922 1.0930 1.0950 1.0923 1.0983 1.0957
irintensity: 0.1130 0.7068 0.1048 0.9702 0.0229 0.6434 1.2994 0.4684 1.2519 0.9207 0.0847 0.7011 0.7239 0.4312 4.4576 0.9317 8.6116 1.8819 1.3306 16.6229 1.2246 1.3355 0.0801 8.5858 3.8699 12.8029 1.1827 1.4559 1.0935 101.0110 1.1807 1.5331 1.9507 50.6069 23.3881 5.1338 8.0132 1.1014 6.8700 1.0085 18.7831 4.9521 8.4301 0.3412 0.7342 45.9995 6.7780 4.0124 3.8865 7.1925 10.7110 6.3130 13.8430 1.1458 0.4725 0.9525 1.8178 24.7254 16.9808 7.7759 4.1424 16.3020 9.5929 16.9118 11.0218 2.7213 12.2484 2.3867 0.7447 10.6031 4.3623 11.4327 11.8457 40.8652 3.1859 10.0603 4.8517 0.0057 9.3327 34.5766 16.2074 10.5959 1.4399 2.7401 24.2938 4.1378 8.9657 9.7072 8.9469 42.6172 8.1442 35.1117 41.2333
temp: 298.150 k
press: 1.00000 atm
elementType: 9 6 6 6 6 6 6 6 6 6 6 6 6 6 6 6 6 6 6 6 1 1 1 1 1 1 1 1 1 1 1 1 1
symmnumber: 1
zpe: 673823.8 jmol-1
zpe.correction: 0.256646 hartree
zpe.thermalcorrener: 0.271651 hartree
zpe.thermalcorrenthalpy: 0.272595 hartree
zpe.thermalcorrgfe: 0.214007 hartree
zpe.sumelectzpe: -830.356062 hartree
zpe.sumelectthermal: -830.341057 hartree
zpe.sumelectthermalent: -830.340112 hartree
zpe.sumelectthermalfe: -830.398701 hartree
dipole: 0.1669 -1.5600 0.0003
dipole: 1.5689
quadrupole: -94.8733 -106.3319 -122.6193
quadrupole: 1.2381 -0.0011 0.0015
quadrupole: 13.0682 1.6096 -14.6778 1.2381 -0.0011 0.0015
hfenergy: -830.6127075 hartree
pointgroup: C01 [X(C19H13F1)]
dipole: -0.0702092 0.6132396 0.0001275 debye
polarizability: 388.797658|1.0657389|231.7508275|0.0063585|0.0037653|81.0837057 unknown
InChI: InChI=1S/C19H13F/c1-12-15-8-4-2-6-13(15)10-17-16-9-5-3-7-14(16)11-18(20)19(12)17/h2-11H,1H3
charge 0 multiplicity 1
33 atoms
F  0.654244 -3.426625 -0.000746
C  0.420258 0.337388 0.000005
C  -0.050959 -1.050613 -0.000011
C  -1.448681 -1.358023 0.000203
C  -2.404812 -0.281155 0.000057
C  1.862351 0.650675 0.000028
C  -1.932743 1.095565 -0.000013
C  -0.542278 1.361503 0.000046
C  2.820662 -0.421257 -0.000056
C  1.003382 -2.053571 -0.00028
C  2.348145 -1.784652 -0.000276
C  -1.93284 -2.802183 0.000674
C  -3.8339 -0.483663 -0.000093
C  2.365192 1.98632 0.000139
C  -2.878439 2.179866 -0.000117
C  4.219211 -0.138169 -0.000011
C  -4.7261 0.586986 -0.000233
C  -4.247914 1.938449 -0.000215
C  3.743548 2.252448 0.000183
C  4.681899 1.184018 0.000111
H  -0.230687 2.41009 0.000089
H  3.06105 -2.614973 -0.000526
H  -3.028363 -2.873136 0.001935
H  -1.563305 -3.35002 -0.882675
H  -1.561326 -3.350065 0.883139
H  -4.24371 -1.496289 -0.000184
H  1.675154 2.834734 0.000201
H  -2.494363 3.20696 -0.000137
H  4.928084 -0.974139 -0.000079
H  -5.804797 0.39587 -0.000375
H  -4.961156 2.769517 -0.000305
H  4.096752 3.289264 0.000274
H  5.756443 1.39538 0.00015
