program: Gaussian 09
title: 000188382
version: EM64L-G09RevD.01
frameworkgroup: C1[X(C15H23NO2)]
method: RPBEPBE
basis: SDD
operation: Freq
keyword: #p
keyword: freq=noraman
keyword: PBEPBE/SDD
title: #p freq=noraman PBEPBE/SDD
converged: YES YES NO NO
title: Mulliken charges:
elementType: O O N C C C C C C C C C C C C C C C H H H H H H H H H H H H H H H H H H H H H H H
charge: -0.326746 -0.380081 -0.327677 -0.387220 -0.384709 -0.364470 -0.369439 -0.390495 -0.372107 -0.565886 -0.503934 0.504797 0.287650 -0.411145 -0.420005 -0.230993 -0.228339 -0.244753 0.197387 0.193903 0.195013 0.200090 0.195511 0.191790 0.194057 0.190934 0.209858 0.211304 0.204054 0.240544 0.204569 0.206517 0.235622 0.203533 0.230065 0.231037 0.222011 0.222257 0.226236 0.330829 0.378432
chargesum: 0.00000
title: Mulliken charges with hydrogens summed into heavy atoms:
elementType: O O N C C C C C C C C C C C C C C C
charge: -0.326746 -0.001649 0.003153 0.004069 0.010393 0.022832 0.015552 0.030667 0.072491 -0.154801 -0.064779 0.504797 0.287650 -0.181080 -0.188968 -0.008982 -0.006082 -0.018517
polarizability: 2.44467850e+02 -4.39730133e+00 1.59046588e+02 2.38793404e+01 5.71466977e+00 1.26035766e+02
1716.lowfreq: -16.1166 -4.4332 -0.0005 0.0006 0.0010 2.6575 8.5176 15.3947 23.1180
frequency: 2.4398 15.0407 23.0619 25.9401 47.4383 50.7560 60.1840 97.3660 100.7636 116.7920 139.3224 143.6340 147.8539 179.9422 222.8121 258.3189 292.8288 310.4825 332.8777 373.4123 394.4390 402.8638 437.1769 460.8819 507.5116 517.3526 584.1831 617.5061 622.5205 705.1482 721.9721 722.8250 730.8494 748.4145 759.2114 785.5239 809.2307 841.7408 853.3369 911.3268 914.5627 934.6427 972.6301 974.6070 989.1054 989.7708 992.6058 999.0732 1010.2383 1025.2151 1031.4530 1054.1213 1057.8362 1076.7294 1080.5996 1085.3328 1099.4051 1108.8659 1170.9004 1185.5123 1192.1424 1202.2656 1214.9604 1216.3510 1240.3507 1246.1775 1269.4709 1277.7443 1278.1174 1285.0105 1291.8238 1295.2834 1308.8443 1326.0704 1330.4345 1344.3723 1352.6919 1354.5556 1368.0653 1381.9673 1439.6917 1446.2824 1460.6177 1461.0200 1465.1739 1468.7500 1476.8165 1482.6302 1484.6740 1488.6423 1490.3207 1573.6881 1592.3434 1614.0106 2948.8050 2950.7474 2952.7838 2961.6748 2967.6110 2975.6100 2977.4305 2983.5929 2985.8679 2992.4438 3005.0968 3017.7164 3027.8002 3034.2710 3047.7225 3061.4584 3111.5380 3113.5419 3129.5760 3141.2077 3160.3598 3221.8454 3621.1531
redmass: 4.6631 3.7386 4.9733 5.1457 2.3901 3.0846 4.1627 2.4038 2.1018 4.0264 2.0081 2.9006 3.3375 5.7644 3.9943 4.5941 4.1874 3.1014 2.3258 1.4890 3.3374 2.8140 3.5373 2.6765 1.2839 2.5306 4.3094 6.3542 2.7893 1.7302 1.1265 3.1255 1.1438 1.1572 1.9584 1.2392 3.8408 1.3201 1.2504 1.5059 1.4730 3.6490 4.4035 1.4079 2.0898 3.7714 1.3287 2.9666 3.9782 2.3662 3.4917 1.4904 2.6223 2.3596 2.1011 4.9966 1.4232 1.2757 1.0524 1.1142 1.5933 1.2758 1.4244 2.3931 1.3509 1.3381 1.2410 1.2194 1.1064 1.1275 1.1139 1.1250 1.3663 1.2561 1.4080 1.4944 1.6330 1.6402 2.1503 7.8627 2.1763 1.1193 1.0768 1.0728 1.0700 1.0983 1.1079 2.2658 1.1023 1.1050 1.9724 3.5853 6.0426 6.1930 1.0587 1.0588 1.0592 1.0592 1.0588 1.0596 1.0592 1.0820 1.0808 1.0942 1.1006 1.1023 1.0998 1.1047 1.1048 1.1036 1.0871 1.0867 1.0907 1.0958 1.1015 1.0631 1.0830
irintensity: 1.2744 1.8238 0.2148 1.3692 0.8437 0.0542 2.2090 0.3109 0.1921 0.3413 0.0016 0.0862 0.2294 5.3139 25.2349 20.1829 1.0232 24.0491 1.0331 61.5902 9.6018 0.0156 0.6706 29.0793 124.3370 53.7559 5.8414 0.0727 6.5335 52.7981 13.1875 3.5680 0.6316 3.4875 44.7538 0.4973 3.0557 0.9488 0.0445 7.9311 1.5867 19.1527 30.3343 0.6976 4.7910 0.6306 0.4066 23.4012 8.4396 1.5736 26.5339 3.0833 5.3811 1.5906 0.0635 0.2735 12.8659 6.0246 0.0811 0.2084 7.9499 32.6888 1.0069 0.2755 1.5523 0.6553 5.9479 2.2139 0.4330 9.0214 0.2010 10.6685 8.5659 0.1852 8.2538 11.9632 4.5144 0.8541 172.1302 0.1397 6.4205 14.5085 0.4684 0.0599 0.1896 0.1147 3.0358 19.3777 3.2866 38.5455 73.6149 92.2336 1.3781 12.8003 6.9170 1.3108 1.2526 68.8552 19.7969 7.6193 92.9579 19.1130 30.9906 10.2996 1.1405 3.9044 15.1212 19.1677 110.1221 89.3890 10.4944 8.4437 11.0885 48.9905 25.4115 29.3284 63.0579
temp: 298.150 k
press: 1.00000 atm
elementType: 8 8 7 6 6 6 6 6 6 6 6 6 6 6 6 6 6 6 1 1 1 1 1 1 1 1 1 1 1 1 1 1 1 1 1 1 1 1 1 1 1
symmnumber: 1
zpe: 920763.9 jmol-1
zpe.correction: 0.350700 hartree
zpe.thermalcorrener: 0.370900 hartree
zpe.thermalcorrenthalpy: 0.371844 hartree
zpe.thermalcorrgfe: 0.294692 hartree
zpe.sumelectzpe: -789.164101 hartree
zpe.sumelectthermal: -789.143901 hartree
zpe.sumelectthermalent: -789.142957 hartree
zpe.sumelectthermalfe: -789.220109 hartree
dipole: -1.6246 2.6884 -1.0381
dipole: 3.3083
quadrupole: -138.9043 -104.9914 -110.5502
quadrupole: 15.2913 -3.6881 1.5907
quadrupole: -20.7556 13.1572 7.5984 15.2913 -3.6881 1.5907
hfenergy: -789.514801 hartree
pointgroup: C01 [X(C15H23N1O2)]
dipole: -0.6414879 -0.6959257 0.8934632 debye
polarizability: 243.828127|-9.6382546|155.8115629|-23.9277435|-11.2425159|129.9105144 unknown
InChI: InChI=1S/C15H23NO2/c17-15(16-18)13-9-4-2-1-3-6-10-14-11-7-5-8-12-14/h5,7-8,11-12,16,18H,1-4,6,9-10,13H2
charge 0 multiplicity 1
41 atoms
O  6.91303 0.952528 -0.848042
O  8.882392 -0.677761 -0.163546
N  7.60019 -0.757446 0.486099
C  0.164778 0.070257 0.170799
C  1.546546 -0.004572 -0.517006
C  -1.014708 0.011317 -0.825812
C  2.727487 0.04851 0.478155
C  -2.396164 0.065863 -0.137523
C  4.102436 -0.024304 -0.220452
C  -3.576113 -0.005489 -1.147082
C  5.279738 0.024406 0.784829
C  -4.934955 0.018846 -0.462917
C  6.623533 0.118208 0.082422
C  -5.526369 -1.1798 0.015189
C  -5.62409 1.240532 -0.247634
C  -6.767672 -1.160736 0.690028
C  -6.866056 1.266309 0.427083
C  -7.442651 0.064595 0.899605
H  0.098619 1.007193 0.762333
H  0.071232 -0.763361 0.898094
H  1.609437 -0.940277 -1.110998
H  1.64187 0.830181 -1.242043
H  -0.929042 0.851193 -1.546934
H  -0.94119 -0.92047 -1.425513
H  2.665448 0.98588 1.069978
H  2.631293 -0.786149 1.204397
H  -2.486925 -0.771535 0.583792
H  -2.484017 0.998103 0.45633
H  4.168214 -0.954345 -0.819856
H  4.215911 0.817109 -0.929524
H  -3.46938 -0.931999 -1.745872
H  -3.489694 0.843793 -1.853314
H  5.171798 0.924483 1.422357
H  5.250659 -0.855113 1.45867
H  -5.011333 -2.134939 -0.149904
H  -5.185679 2.176583 -0.616607
H  -7.21042 -2.097829 1.047109
H  -7.385135 2.219673 0.579849
H  -8.407102 0.082038 1.419689
H  7.566311 -1.494389 1.187152
H  8.705978 0.082714 -0.811881
