program: Gaussian 09
title: 000188367
version: EM64L-G09RevD.01
frameworkgroup: C1[X(C11H17N4O12P3)]
method: RPBEPBE
basis: SDD
operation: Freq
keyword: #p
keyword: freq=noraman
keyword: PBEPBE/SDD
title: #p freq=noraman PBEPBE/SDD
converged: YES YES NO NO
title: Mulliken charges:
elementType: P P P O O O O O O O O O O O O N N N N C C C C C C C C C C C H H H H H H H H H H H H H H H H H
charge: 1.461234 1.515291 1.381933 -0.238551 -0.566029 -0.627984 -0.737519 -0.677707 -0.534970 -0.774331 -0.643206 -0.616074 -0.682241 -0.664030 -0.558315 -0.155291 -0.129649 -0.070677 -0.618648 -0.094186 -0.048030 -0.103446 -0.552470 -0.313916 0.153493 -0.161185 0.124459 -0.396931 0.143883 -0.361806 0.220906 0.333374 0.278804 0.270871 0.314294 0.258142 0.303673 0.257056 0.396143 0.251203 0.248378 0.341280 0.328669 0.417463 0.436274 0.458022 0.432348
chargesum: 0.00000
title: Mulliken charges with hydrogens summed into heavy atoms:
elementType: P P P O O O O O O O O O O O O N N N N C C C C C C C C C C C
charge: 1.461234 1.515291 1.381933 -0.238551 -0.169886 -0.627984 -0.737519 -0.260244 -0.534970 -0.774331 -0.206932 -0.616074 -0.224219 -0.231682 -0.558315 -0.155291 -0.129649 -0.070677 0.051301 0.126720 0.285344 0.175358 0.032695 0.247900 0.153493 0.095871 0.124459 -0.145729 0.143883 -0.113429
polarizability: 3.40386368e+02 -2.04306851e+01 2.67054955e+02 -6.16290533e+00 -1.70395726e+01 1.72573894e+02
1716.lowfreq: -3.6566 -0.0012 -0.0010 -0.0007 1.5149 4.4453 14.8918 22.0654 24.5330
frequency: 14.6631 22.0206 24.5311 37.9782 43.8773 49.3079 59.8292 69.0647 79.7941 88.0658 111.1463 125.4670 133.3047 146.1529 154.3124 172.3264 186.2026 198.6976 204.1936 208.3708 220.4654 232.2025 239.5000 247.6265 252.9667 263.1923 275.1480 278.5281 300.5096 314.4424 331.4960 338.5051 344.3051 347.8677 357.8837 368.1340 375.4205 389.9626 392.0416 418.6761 434.4032 437.5420 456.5186 491.8059 509.6834 514.3991 517.3818 534.2477 545.7365 555.5924 559.5500 574.1369 581.7685 619.1778 650.9407 664.3764 670.6709 696.4367 703.6303 714.1714 725.4340 730.8272 735.6996 758.6806 773.0711 799.6315 800.8411 811.6149 834.1073 838.8871 859.0016 862.5481 881.5973 908.1901 925.1627 928.7132 954.4717 973.1292 988.4154 1002.1958 1014.3253 1021.8214 1036.7099 1060.0007 1075.7861 1081.2761 1086.3499 1094.1062 1104.2948 1125.6661 1167.5429 1168.6211 1182.7715 1191.5941 1209.1348 1238.5119 1250.7761 1254.5594 1271.8650 1279.1317 1284.9628 1297.9557 1323.4957 1333.5902 1337.2450 1346.6258 1353.4754 1383.5346 1397.5004 1400.9397 1439.7919 1447.2251 1457.6340 1480.4537 1501.0463 1543.1066 1580.9701 1628.4366 2622.4840 2981.3589 3032.9941 3040.7206 3063.8970 3099.3607 3116.0535 3136.1833 3162.0619 3209.3981 3235.9323 3333.6340 3366.6313 3544.7123 3588.4941 3597.5552 3701.0949
redmass: 7.8340 7.1562 9.7178 8.6204 8.6482 11.1838 9.2225 6.6446 6.0254 8.7905 8.5539 8.8006 6.7384 6.3608 6.1186 7.0463 5.9866 3.9680 7.0825 6.6191 7.0341 7.5946 3.8650 4.4933 4.9274 6.4245 3.0164 3.9321 4.3127 6.6374 4.1427 6.9953 7.2746 4.6394 6.2923 1.4065 7.8837 5.6508 5.2137 7.0131 1.1614 3.0178 4.1258 3.4017 4.9522 5.4012 4.6997 1.8025 1.2897 3.4479 3.2050 4.4738 1.4593 3.4268 6.8198 6.0361 5.5527 6.7218 12.8502 9.9774 1.5017 5.3198 10.0568 4.1096 13.6727 7.0634 13.5651 2.8308 4.6116 7.8792 1.4057 5.4163 3.1111 2.9485 1.4434 7.6385 2.7554 2.6618 2.2534 2.8425 1.4409 1.7659 2.9876 1.6260 2.1693 6.6328 3.1633 1.5282 3.1488 1.4071 1.6507 1.5036 2.5197 1.6158 1.2136 2.2060 1.4215 1.4702 1.8444 1.0956 1.6412 1.5915 1.5175 2.3757 1.6809 2.2540 3.1282 1.2154 1.2809 1.8206 2.1590 3.3167 1.0908 1.0767 5.5335 5.5149 2.9105 1.7721 1.0760 1.0689 1.0873 1.0614 1.0873 1.1021 1.1040 1.0898 1.0923 1.0909 1.1069 1.0671 1.0651 1.0455 1.0663 1.0662 1.1042
irintensity: 0.7505 0.5348 0.5515 0.9153 0.2898 4.4095 0.1849 8.6045 0.6512 2.2473 7.9633 0.9044 1.2770 2.3650 0.7280 2.8390 1.1886 9.8646 1.3736 3.1763 11.9258 7.4165 36.8864 22.6320 5.4680 15.5199 25.1477 9.8392 67.3883 3.4516 30.6814 4.5163 4.0387 9.8113 66.6932 87.4674 106.9990 53.8279 59.3146 59.5200 155.8207 16.5269 40.2471 7.2571 5.0888 36.1591 3.6201 175.4016 89.4186 114.5757 9.3165 16.1244 25.1727 30.1312 60.7175 23.6566 35.6260 28.2669 359.3229 113.3593 120.1342 40.5705 213.8982 10.9557 239.4304 3.6689 432.2561 37.6451 77.2967 185.2175 1.9160 12.6107 18.2084 88.9347 12.8366 301.7847 5.2708 90.9075 28.9004 133.1268 9.7610 6.0087 6.4884 15.4085 54.3848 228.9110 70.1106 17.3788 196.0505 188.1614 47.9661 116.8840 11.9548 30.5074 104.6819 123.7860 37.1051 6.9950 55.2433 106.2438 5.5465 4.3627 6.0070 30.5866 7.2849 54.9087 199.1542 18.7200 28.6999 15.2107 24.2553 8.5610 27.2007 25.9190 125.2790 42.0572 102.1811 545.7999 2297.1114 47.8303 28.0997 14.1873 17.8531 14.5377 4.7061 1.9486 10.9272 1.3919 1.1236 165.4742 202.9858 133.6774 102.8752 31.7119 37.0946
temp: 298.150 k
press: 1.00000 atm
elementType: 15 15 15 8 8 8 8 8 8 8 8 8 8 8 8 7 7 7 7 6 6 6 6 6 6 6 6 6 6 6 1 1 1 1 1 1 1 1 1 1 1 1 1 1 1 1 1
symmnumber: 1
zpe: 838749.5 jmol-1
zpe.correction: 0.319463 hartree
zpe.thermalcorrener: 0.350611 hartree
zpe.thermalcorrenthalpy: 0.351555 hartree
zpe.thermalcorrgfe: 0.255878 hartree
zpe.sumelectzpe: -2572.460050 hartree
zpe.sumelectthermal: -2572.428902 hartree
zpe.sumelectthermalent: -2572.427958 hartree
zpe.sumelectthermalfe: -2572.523635 hartree
dipole: -14.5462 -3.6865 -0.6159
dipole: 15.0187
quadrupole: -195.6618 -208.7926 -201.4887
quadrupole: 17.5017 -8.6153 -4.7880
quadrupole: 6.3193 -6.8116 0.4923 17.5017 -8.6153 -4.7880
hfenergy: -2572.7795128 hartree
pointgroup: C01 [X(C11H17N4O12P3)]
dipole: 5.8051817 -0.2613834 -1.070316 debye
polarizability: 329.2708886|43.3590157|223.6210113|-6.8198637|47.9100958|227.1233164 unknown
InChI: InChI=1S/C11H17N4O12P3/c12-10-6-1-2-15(11(6)14-5-13-10)9-3-7(16)8(25-9)4-24-29(20,21)27-30(22,23)26-28(17,18)19/h1-2,5,7-9,16-18,20,22H,3-4,12H2
charge 0 multiplicity 1
47 atoms
P  -1.758195 1.460698 2.198471
P  -4.487935 0.68963 0.85962
P  -4.590558 -2.222087 -0.26283
O  0.631969 -0.421777 -1.897653
O  -1.178248 -2.618715 -0.860115
O  -1.575199 1.497122 0.478659
O  -3.437616 1.105222 2.20269
O  -0.978357 -0.025121 2.578596
O  -1.309515 2.69413 3.072866
O  -3.71679 -0.690611 0.214596
O  -4.229524 1.951583 -0.242752
O  -5.988203 0.435032 1.291695
O  -3.40314 -3.322619 0.118388
O  -5.706405 -2.419069 1.000692
O  -5.116989 -2.116932 -1.74906
N  2.934001 -0.622912 -1.065929
N  2.652211 0.665439 1.040394
N  4.600789 2.020466 1.64061
N  6.549928 2.124148 0.352742
C  1.649844 -1.301864 -1.22696
C  -0.514285 -1.513607 -0.116993
C  -0.522937 -0.228494 -0.969692
C  0.984618 -1.804057 0.08084
C  -0.306945 1.095273 -0.208216
C  3.358586 0.266638 -0.063985
C  3.969238 -0.720065 -2.02368
C  4.6804 0.700799 -0.400422
C  5.049048 0.066312 -1.645089
C  5.287303 1.612779 0.521693
C  3.341684 1.536562 1.83438
H  1.830972 -2.120919 -1.945452
H  -1.073622 -1.426798 0.822342
H  -1.430632 -0.163564 -1.593162
H  1.166748 -2.876172 0.249466
H  1.358863 -1.231224 0.944304
H  -0.101578 1.897945 -0.934453
H  0.530958 1.028685 0.511534
H  3.838741 -1.347153 -2.904072
H  -0.929483 -2.620429 -1.816536
H  5.979287 0.164059 -2.201972
H  2.824351 1.89414 2.729628
H  6.900216 2.773148 1.055591
H  7.126749 1.880216 -0.447116
H  -0.591601 -0.063151 3.491006
H  -3.247832 2.108159 -0.391412
H  -2.470994 -3.131766 -0.321147
H  -6.230722 -1.584181 1.204298
