program: Gaussian 09
title: 000196443
version: EM64L-G09RevD.01
frameworkgroup: C1[X(C7H10N6O)]
method: RPBEPBE
basis: SDD
operation: Freq
keyword: #p
keyword: freq=noraman
keyword: PBEPBE/SDD
title: #p freq=noraman PBEPBE/SDD
converged: YES YES NO NO
title: Mulliken charges:
elementType: O N N N N N N C C C C C C C H H H H H H H H H H
charge: -0.485746 -0.471909 -0.359940 -0.088091 0.007083 -0.068362 -0.637492 0.145542 0.183563 -0.075239 -0.344404 0.146758 -0.320371 -0.395332 0.292967 0.232238 0.269992 0.321128 0.204707 0.214071 0.238389 0.334437 0.298001 0.358007
chargesum: 0.00000
title: Mulliken charges with hydrogens summed into heavy atoms:
elementType: O N N N N N N C C C C C C C
charge: -0.127739 -0.178942 -0.038811 -0.088091 0.007083 -0.068362 -0.005053 0.145542 0.183563 -0.075239 0.157827 0.146758 0.098407 -0.156942
polarizability: 1.95994456e+02 2.03997687e-01 1.26621180e+02 -5.81793380e+00 -8.01734320e-01 6.14451195e+01
1716.lowfreq: -9.0532 0.0009 0.0010 0.0011 1.3134 8.2500 10.1579 58.3872 87.4688
frequency: 8.2923 58.2814 87.4673 119.2395 145.4730 160.0638 223.6517 240.3879 261.6400 272.2304 306.0501 343.9041 418.9422 432.8387 472.3860 496.8138 510.6138 536.1878 559.0235 568.1490 588.8110 647.5738 659.9309 696.9944 783.8125 790.4043 848.5148 857.5143 902.2605 925.2311 950.9547 987.3829 1033.5608 1073.2553 1102.9701 1111.3313 1166.9835 1188.2549 1207.9691 1248.4754 1265.4332 1285.9012 1300.7612 1325.9598 1353.6431 1358.2854 1381.8335 1399.8919 1419.6312 1466.5748 1470.9610 1477.3821 1512.1542 1601.3560 1620.2062 1650.3211 2967.5474 2987.4261 3033.0068 3086.2308 3157.9186 3552.2643 3567.0317 3592.6886 3597.6720 3710.2739
redmass: 4.5915 4.3721 4.2036 2.4638 3.3970 4.6377 1.7928 3.8625 1.6694 2.5448 2.3508 4.1333 3.4434 1.1494 4.1857 1.1411 2.7386 1.8040 4.0575 2.9533 5.6024 8.7057 5.2788 9.0666 11.4535 3.4303 7.6053 3.3366 2.7205 1.4203 2.2849 3.7894 3.2204 1.8648 4.9963 2.0468 1.4673 1.8855 1.1601 1.8990 1.6325 8.8008 2.4655 1.9442 4.8767 1.5358 3.0540 1.4617 1.9595 1.1607 1.1277 1.6084 5.1744 1.4932 4.4807 5.5187 1.0557 1.0687 1.1066 1.0969 1.0916 1.0455 1.0772 1.0809 1.0668 1.1037
irintensity: 2.7600 6.2337 8.0919 11.7962 0.7572 3.2800 100.8923 3.1571 88.1375 88.5976 10.5302 20.2914 17.0742 50.0429 8.4544 94.4137 70.0078 193.8823 0.2707 59.1574 0.4268 1.9185 13.4045 0.0728 8.9275 3.8169 21.8370 24.7539 0.3298 13.3467 10.3849 20.0421 69.6689 13.1134 29.2584 16.5907 61.8677 70.3582 2.4571 5.2284 12.2197 14.8123 40.0920 21.8137 169.3561 120.7686 61.7683 0.5084 13.0778 49.3246 4.1091 22.9777 198.8028 80.3562 1016.3397 261.2509 63.1760 36.5766 92.3653 6.6056 27.0258 84.2364 110.4700 22.9008 7.2225 26.1807
temp: 298.150 k
press: 1.00000 atm
elementType: 8 7 7 7 7 7 7 6 6 6 6 6 6 6 1 1 1 1 1 1 1 1 1 1
symmnumber: 1
zpe: 485302.1 jmol-1
zpe.correction: 0.184842 hartree
zpe.thermalcorrener: 0.198019 hartree
zpe.thermalcorrenthalpy: 0.198963 hartree
zpe.thermalcorrgfe: 0.143343 hartree
zpe.sumelectzpe: -675.443390 hartree
zpe.sumelectthermal: -675.430213 hartree
zpe.sumelectthermalent: -675.429269 hartree
zpe.sumelectthermalfe: -675.484889 hartree
dipole: 5.4417 7.0121 0.9850
dipole: 8.9303
quadrupole: -66.7872 -76.1056 -83.4852
quadrupole: -10.4302 7.4814 0.1673
quadrupole: 8.6721 -0.6462 -8.0259 -10.4302 7.4814 0.1673
hfenergy: -675.6282322 hartree
pointgroup: C01 [X(C7H10N6O1)]
dipole: 2.1888494 2.7449164 0.1371856 debye
dipolederiv: -0.6138692 -0.112723 0.2129161 -0.2163523 -0.7349558 -0.0123567 0.2529743 0.0137203 -0.3880184 -0.9003929 -0.0094372 0.0437217 0.147106 -0.5130608 0.0115821 0.0644823 0.0236313 -0.3072696 -2.037636 0.0609967 0.0676998 -0.1763182 -0.2790898 0.0014562 0.0754929 0.0074942 -0.5203755 -1.4273625 -0.1556442 0.1050143 -0.6169599 -0.4780555 0.0638646 0.1558135 0.0296109 -0.3117999 -0.8004644 -0.0610138 0.062132 -0.071386 -0.5257276 0.0363709 0.074919 0.0372725 -0.2295387 -0.6458661 -0.1551062 0.0536604 0.0973063 -0.8967253 0.0553501 0.0320012 0.0889044 -0.2475174 -0.4121489 0.3787419 -0.0868272 0.7159361 -1.3058471 -0.01911 -0.1044503 -0.0076137 -0.7314551 -0.2611293 0.5926036 -0.0406496 0.8065802 -0.3909942 -0.0290676 -0.0458154 -0.0186321 0.0605515 2.3904705 -0.0313876 -0.1577051 0.6261837 0.7472392 -0.1048828 -0.3007854 -0.0642437 0.2197605 1.4099246 0.1631495 -0.1422024 -0.2873187 0.426125 -0.0063434 -0.1172383 -0.0500986 0.0883529 0.5414988 -0.2275781 -0.0624243 -0.6193132 0.198344 0.0754164 -0.0350045 0.0348474 0.2808247 0.9258658 -0.5182575 -0.0103549 -0.7051641 1.6100769 -0.0785712 -0.0068284 -0.0880693 0.1996894 0.4367837 0.1565398 -0.1281503 0.2412669 0.5976604 -0.0558571 -0.0816037 -0.0324336 0.2830432 0.5820904 0.0057578 -0.0746945 -0.0453964 0.6386069 -0.0672237 -0.0695028 -0.0743449 -0.0695827 0.1312312 0.0138472 0.0238398 -0.012435 0.1084715 0.0243419 0.0261044 0.0209936 0.3528266 -0.1093746 0.0627913 0.0623505 0.1456815 0.0708781 -0.0153307 0.1093503 -0.0658025 -0.132455 0.1554057 -0.0684849 0.0140349 0.0118032 0.0259028 0.0280271 -0.0101354 0.0382932 0.0938983 0.2933124 0.0418083 0.0410111 0.1639496 0.1270445 -0.0026995 0.0323059 -0.0116298 0.3563283 -0.1780625 0.1273368 0.0060688 0.0859071 -0.1279309 0.0186746 0.0238819 -0.00377 0.0744602 0.0524491 -0.0397672 0.0930455 -0.0596916 -0.0109939 -0.0241494 0.0639206 0.0340141 -0.1798164 -0.036659 -0.100359 0.0279316 -0.1022471 -0.0001938 0.0240282 0.0284515 0.0237983 0.1231813 0.225177 -0.0309027 0.0211697 -0.0463492 0.2084265 0.0252313 0.0186675 0.0270947 0.3783221 0.1062625 -0.0363003 0.0392058 -0.0634127 0.2079302 0.0274613 0.0372832 0.0352731 0.3797499 0.1724939 -0.056611 -0.1707939 -0.0193764 0.2968686 0.0237872 -0.2242845 0.0016901 0.2268399 unknown
polarizability: 195.7451267|-1.4898124|126.1307414|-8.0420801|-5.7205917|62.1848877 unknown
InChI: InChI=1S/C7H10N6O/c8-5-4-6(11-3-10-5)13-7(12-4)9-1-2-14/h3,9,12,14H,1-2,8H2
charge 0 multiplicity 1
24 atoms
O  4.997346 0.983678 0.106777
N  0.067971 1.185611 -0.202072
N  2.362572 0.394415 -0.366267
N  0.476796 -1.070882 -0.020737
N  -1.872944 -1.778706 0.305654
N  -3.505747 0.059043 0.298815
N  -2.949198 2.322291 0.007448
C  -1.187788 0.567193 -0.004276
C  1.024823 0.153032 -0.199528
C  -0.901001 -0.835828 0.104182
C  3.353517 -0.688523 -0.377022
C  -2.527027 1.004862 0.095294
C  4.514068 -0.341106 0.557143
C  -3.127542 -1.252754 0.391592
H  0.255702 2.178708 -0.320617
H  3.744535 -0.842057 -1.402217
H  2.849395 -1.615316 -0.056065
H  2.73764 1.342004 -0.423365
H  5.310316 -1.107378 0.467628
H  4.161708 -0.289094 1.607146
H  -3.941463 -1.96615 0.554575
H  -3.94886 2.493342 0.095772
H  -2.318297 3.097778 -0.165901
H  5.769878 1.269037 0.652941
