program: Gaussian 09
title: 000188360
version: EM64L-G09RevD.01
frameworkgroup: C1[X(C13H14N2OS)]
method: RPBEPBE
basis: SDD
operation: Freq
keyword: #p
keyword: freq=noraman
keyword: PBEPBE/SDD
title: #p freq=noraman PBEPBE/SDD
converged: YES YES NO NO
title: Mulliken charges:
elementType: S O N N C C C C C C C C C C C C C H H H H H H H H H H H H H H
charge: -0.086924 -0.270406 -0.442792 -0.617881 0.420354 0.498893 0.386027 -0.194486 -0.680018 0.163464 -0.374507 -0.422080 -0.672402 -0.419940 -0.411303 -0.241903 -0.245531 0.251379 0.238647 0.322175 0.308906 0.238229 0.298566 0.283787 0.237583 0.241585 0.227815 0.228476 0.328515 0.281999 0.123775
chargesum: 0.00000
title: Mulliken charges with hydrogens summed into heavy atoms:
elementType: S O N N C C C C C C C C C C C C C
charge: 0.036850 -0.270406 -0.120617 -0.007367 0.420354 0.498893 0.386027 0.056893 -0.441372 0.163464 -0.065601 -0.183851 -0.090049 -0.182357 -0.169719 -0.014088 -0.017055
polarizability: 2.92948924e+02 2.98208782e+01 1.80706789e+02 1.01812010e+01 -1.61306900e+01 9.12873952e+01
1716.lowfreq: -2.4268 -0.0023 -0.0017 -0.0011 8.4230 14.3055 31.2422 43.9173 58.3301
frequency: 31.0572 43.8428 58.2948 76.4953 120.5601 131.5376 179.0926 182.7146 186.8636 231.8651 250.1221 269.2481 293.1292 342.9369 351.5890 379.7812 407.5437 417.1825 477.4129 513.3014 530.6987 537.0936 598.6952 621.5950 641.1391 658.0511 659.6043 683.8766 731.7332 752.2238 759.4586 769.4278 781.0410 785.5852 840.9520 862.0074 874.5944 904.5571 907.4838 943.9635 958.6752 961.8232 988.7480 1001.2391 1022.4740 1029.9524 1102.3179 1123.2960 1143.1417 1155.8434 1161.0784 1172.7290 1185.0861 1215.4364 1243.4737 1254.1439 1277.6947 1300.9037 1304.6641 1345.5049 1366.2556 1405.7256 1421.1940 1430.1661 1437.8114 1465.3635 1507.9374 1547.1670 1584.5529 1595.0900 1609.9624 1640.5249 1643.7300 2439.4877 2963.6586 3055.3362 3110.5777 3119.4887 3124.8928 3131.5530 3138.2165 3142.3831 3161.9556 3194.0533 3374.3470 3465.2729 3632.0429
redmass: 4.8437 5.5542 4.8829 6.0492 4.1142 2.9471 1.4467 5.8792 3.5409 3.9775 4.3753 1.4391 2.4603 3.9773 4.5392 5.4880 3.3596 4.7441 2.4599 6.7727 6.6523 3.4684 1.4515 6.1236 3.1240 3.1443 4.0965 2.6257 3.0729 1.3757 4.0368 1.3870 1.3898 2.2654 1.2668 4.4497 1.5922 3.6137 1.8860 2.9681 2.1480 1.3928 1.3316 1.3390 2.3126 4.7147 1.4347 1.7663 1.3516 1.7075 1.2220 1.1203 1.9778 1.7317 1.6215 1.2532 1.7983 1.5888 1.7645 1.7511 1.5526 3.8901 3.3780 1.1523 4.3242 2.3054 3.2418 2.7145 3.7585 1.9338 4.0504 2.4286 3.8464 1.0386 1.0843 1.0581 1.0915 1.0858 1.0890 1.0906 1.1089 1.0948 1.1004 1.0948 1.0782 1.0488 1.0961
irintensity: 2.2337 0.2406 10.8033 0.5516 6.3098 5.9483 26.7005 11.1972 3.4380 4.3321 9.1715 36.8234 3.8177 6.8642 22.8937 28.7455 0.8993 8.8092 21.4651 0.5891 3.9626 0.3129 296.9137 4.0898 63.1955 6.0050 26.7219 8.7953 17.0574 109.1980 2.0244 12.0673 1.6732 13.6486 9.8264 17.0248 99.2003 13.0638 21.8929 4.1702 1.6368 12.1449 0.0149 0.3461 5.1656 7.8118 23.6317 5.6728 11.6176 15.0240 2.3637 3.3622 13.2105 24.0787 13.8884 5.2669 7.2491 57.7401 52.9572 72.2439 0.5707 14.9368 26.8987 12.9172 24.1841 7.2573 299.8299 150.1800 177.2463 77.2181 81.8943 47.9401 40.0550 19.8073 24.4423 15.1666 15.3175 5.9509 0.2352 10.3261 5.4458 34.4974 38.2898 8.3232 165.3677 34.3828 30.9103
temp: 298.150 k
press: 1.00000 atm
elementType: 16 8 7 7 6 6 6 6 6 6 6 6 6 6 6 6 6 1 1 1 1 1 1 1 1 1 1 1 1 1 1
symmnumber: 1
zpe: 636684.4 jmol-1
zpe.correction: 0.242500 hartree
zpe.thermalcorrener: 0.258419 hartree
zpe.thermalcorrenthalpy: 0.259364 hartree
zpe.thermalcorrgfe: 0.198249 hartree
zpe.sumelectzpe: -1085.366726 hartree
zpe.sumelectthermal: -1085.350807 hartree
zpe.sumelectthermalent: -1085.349863 hartree
zpe.sumelectthermalfe: -1085.410978 hartree
dipole: 0.1340 1.2429 -0.9397
dipole: 1.5639
quadrupole: -95.7796 -109.7817 -107.9292
quadrupole: 0.8547 7.7108 -0.9233
quadrupole: 8.7172 -5.2849 -3.4323 0.8547 7.7108 -0.9233
hfenergy: -1085.6092266 hartree
pointgroup: C01 [X(C13H14N2O1S1)]
dipole: 0.0956707 -0.5599152 -0.2365087 debye
polarizability: 289.9413297|10.2926915|128.7839462|-40.4535546|43.5769008|146.2178317 unknown
InChI: InChI=1S/C13H14N2OS/c14-12(8-17)13(16)15-11-6-5-9-3-1-2-4-10(9)7-11/h1-7,12,15,17H,8,14H2
charge 0 multiplicity 1
31 atoms
S  -3.363034 -1.262751 -2.213639
O  -2.559605 0.943076 1.819809
N  -1.481946 -0.512181 0.313942
N  -4.960723 -0.255898 1.550504
C  2.179995 -0.373855 -0.464415
C  -0.123793 -0.084374 0.368482
C  2.62627 0.696414 0.405629
C  -3.924173 -0.734603 0.639808
C  0.799449 -0.74199 -0.460627
C  -2.585961 -0.013663 0.984489
C  0.314631 0.97697 1.234381
C  1.658759 1.345034 1.240971
C  -4.405434 -0.451089 -0.819522
C  3.14192 -1.029744 -1.304732
C  4.010347 1.068323 0.401954
C  4.484259 -0.644986 -1.286682
C  4.924253 0.412858 -0.42688
H  -3.763839 -1.829422 0.735813
H  0.466711 -1.556085 -1.118267
H  -1.69536 -1.239211 -0.385709
H  -0.41847 1.476088 1.870125
H  1.990535 2.154683 1.901921
H  -5.410977 -0.882156 -0.935349
H  -4.465975 0.63254 -1.005701
H  2.807892 -1.840311 -1.963796
H  4.342675 1.878618 1.061908
H  5.209711 -1.152359 -1.932235
H  5.980373 0.703672 -0.423674
H  -4.652528 0.534298 2.127889
H  -5.509742 -0.964303 2.035295
H  -2.636022 -0.138191 -2.568392
