program: Gaussian 09
title: 000188335
version: EM64L-G09RevD.01
frameworkgroup: C1[X(C11H19N3O7S)]
method: RPBEPBE
basis: SDD
operation: Freq
keyword: #p
keyword: freq=noraman
keyword: PBEPBE/SDD
title: #p freq=noraman PBEPBE/SDD
converged: YES YES NO NO
title: Mulliken charges:
elementType: S O O O O O O O N N N C C C C C C C C C C C H H H H H H H H H H H H H H H H H H H
charge: 0.097666 -0.223086 -0.310012 -0.416396 -0.229059 -0.402687 -0.231192 -0.409331 -0.210714 -0.639354 -0.565079 -0.396296 -0.485285 -0.120372 -0.155070 0.259321 0.266427 -0.473247 -0.746656 0.147300 0.245074 -0.511278 0.242116 0.229570 0.263048 0.243588 0.239324 0.240779 0.308702 0.262374 0.281988 0.299464 0.296474 0.289281 0.289978 0.312539 0.266940 0.282832 0.382141 0.388996 0.389190
chargesum: 0.00000
title: Mulliken charges with hydrogens summed into heavy atoms:
elementType: S O O O O O O O N N N C C C C C C C C C C C
charge: 0.097666 -0.223086 -0.310012 -0.034255 -0.229059 -0.013691 -0.231192 -0.020141 -0.210714 -0.036837 0.020676 0.075390 0.021351 0.118952 0.085709 0.259321 0.266427 0.097829 -0.165205 0.147300 0.245074 0.038494
polarizability: 2.09920040e+02 -2.92961389e+00 1.70622839e+02 3.32366669e+00 1.10347284e+00 1.74044462e+02
1716.lowfreq: -17.5743 -6.5437 -5.0821 -0.0019 -0.0006 -0.0003 14.1336 15.6283 21.6716
frequency: 13.1222 13.6803 21.4730 35.5193 40.4255 47.6400 55.7833 67.3523 76.7743 94.0201 104.2288 112.0074 129.8343 136.8767 152.5416 169.7045 190.8915 197.1464 232.3238 243.7523 255.1991 279.2605 287.8781 314.1474 321.1836 330.2801 351.2090 365.9712 383.2600 395.6849 405.3693 425.8739 438.4761 457.7241 499.4741 521.6655 538.6657 569.7126 582.4110 591.2621 605.2650 621.2596 628.7568 655.4589 693.7081 708.6182 723.0590 742.6139 767.6040 783.0447 823.6372 848.7695 865.0539 915.9104 920.8259 922.0219 958.1584 1008.9974 1017.0387 1037.1206 1045.5081 1050.8328 1060.0550 1089.1694 1100.0945 1107.6713 1110.1479 1138.4378 1149.4656 1175.7832 1190.1102 1205.7845 1213.5737 1236.2778 1252.5970 1260.3043 1269.6910 1287.1489 1289.9359 1292.5289 1314.9902 1325.8874 1350.1807 1356.1577 1359.6503 1380.6451 1413.1652 1420.0299 1429.4528 1447.5703 1461.3675 1473.6368 1558.4757 1599.9599 1616.4452 1629.6733 1672.8828 1679.8100 2988.5181 2991.3980 3008.4061 3029.2271 3031.0141 3040.2178 3049.5617 3075.3919 3080.1226 3116.9725 3127.2687 3139.1011 3321.7287 3482.0606 3511.8109 3526.8776 3529.2838 3620.7529 3677.9511
redmass: 5.9697 6.2344 6.5441 8.5986 6.6872 8.1918 6.9965 6.4518 5.0907 8.0607 7.5827 7.1356 2.3336 3.4248 3.1955 2.5509 1.7029 5.4286 4.0821 3.7937 2.9382 1.7944 1.8737 2.8374 3.6604 1.6914 4.7488 4.4450 3.9373 4.3877 3.6752 4.4470 4.4796 2.1495 3.2782 1.3863 3.3715 5.4642 2.0550 3.0906 2.1002 1.4196 3.5574 2.7440 6.8118 4.2706 4.3017 1.3136 2.5243 2.0744 3.0324 4.2554 3.6080 1.5021 2.2144 1.5280 2.9149 2.5564 3.1209 6.4817 2.9301 2.8025 2.7685 2.5292 3.2559 1.3771 1.2616 1.5569 2.3115 1.0941 1.7093 1.8114 1.8024 1.4918 1.3375 1.5829 1.4081 1.1479 1.4924 1.3431 1.2603 1.5365 1.5779 1.6530 1.6850 1.8154 1.2055 1.1201 1.0951 1.0935 1.0923 1.0875 7.1100 1.2139 8.4764 1.1003 5.1103 9.0129 1.0838 1.0612 1.0598 1.0599 1.0600 1.0975 1.0630 1.0854 1.1037 1.1025 1.0970 1.1099 1.0674 1.0442 1.0640 1.0643 1.0447 1.1008 1.1018
irintensity: 0.4019 0.1572 0.0913 2.4455 0.5870 1.4382 1.4510 2.6920 12.9248 3.2493 0.1318 2.1812 13.2585 5.8521 4.8666 30.3905 78.2551 1.4257 0.6389 1.9684 2.4085 133.1222 85.0363 28.7640 52.8644 102.9923 7.6806 16.7230 13.2226 5.4003 27.7681 21.1020 10.3547 27.9636 35.1885 293.4518 39.1362 48.1932 95.2981 1.9849 46.6497 145.7985 32.3730 16.2682 18.2786 42.5929 25.7654 102.8651 38.5638 14.7452 4.4530 4.1548 27.6872 11.2721 15.5981 14.3432 73.1668 62.1877 43.0999 112.8837 160.9707 268.0486 209.7480 25.7353 34.4008 10.7144 10.9432 18.0529 271.2615 36.8941 14.4353 7.4987 9.1142 32.4075 1.5888 35.7809 66.1055 0.9800 19.6399 53.0969 7.7530 21.1294 20.0131 122.3555 50.5925 16.3866 42.7411 65.8212 61.7099 32.6682 15.8094 2.4695 105.6113 125.7888 142.4524 42.1293 183.6435 187.3273 23.4355 20.6583 13.0230 32.1250 1.4667 4.6809 12.3713 18.9526 22.2499 1.3287 1.7856 24.2000 222.6296 12.3419 24.3810 43.6577 18.2022 8.5503 16.3991
temp: 298.150 k
press: 1.00000 atm
elementType: 16 8 8 8 8 8 8 8 7 7 7 6 6 6 6 6 6 6 6 6 6 6 1 1 1 1 1 1 1 1 1 1 1 1 1 1 1 1 1 1 1
symmnumber: 1
zpe: 825779.1 jmol-1
zpe.correction: 0.314523 hartree
zpe.thermalcorrener: 0.340289 hartree
zpe.thermalcorrenthalpy: 0.341233 hartree
zpe.thermalcorrgfe: 0.254331 hartree
zpe.sumelectzpe: -1517.726418 hartree
zpe.sumelectthermal: -1517.700652 hartree
zpe.sumelectthermalent: -1517.699707 hartree
zpe.sumelectthermalfe: -1517.786610 hartree
dipole: 0.4391 1.6157 4.3688
dipole: 4.6787
quadrupole: -152.7419 -143.2993 -131.2480
quadrupole: 9.6435 -9.5065 -5.2144
quadrupole: -10.3122 -0.8696 11.1817 9.6435 -9.5065 -5.2144
hfenergy: -1518.0409406 hartree
pointgroup: C01 [X(C11H19N3O7S1)]
dipole: -0.3735873 -1.3988124 1.136699 debye
polarizability: 210.0823985|-3.4272233|172.7787938|-1.2674534|-2.0055869|171.726149 unknown
InChI: InChI=1S/C11H19N3O7S/c12-6(11(20)21)1-2-8(16)14(3-9(17)18)10(19)7(13)4-22-5-15/h6-7,15,17,20H,1-5,12-13H2
charge 0 multiplicity 1
41 atoms
S  -4.467759 1.222551 -0.487899
O  0.702595 -1.986976 -1.039272
O  -0.940785 1.450988 0.569366
O  5.499229 -0.943165 1.438934
O  6.111701 0.240572 -0.464081
O  -3.342898 -2.442032 -2.305507
O  -2.059341 -0.516886 -2.564679
O  -2.562708 3.368831 -0.511699
N  -1.003049 -0.834928 0.044605
N  3.867258 1.852523 -0.202184
N  -2.315075 0.299755 2.964058
C  2.845179 -0.497016 0.027747
C  1.404016 0.030529 0.146393
C  3.868324 0.590495 0.524632
C  -2.788769 0.208923 1.574319
C  0.386227 -0.983714 -0.348433
C  -1.546283 0.332443 0.640506
C  -1.904823 -1.87667 -0.488443
C  -3.812836 1.317352 1.272763
C  5.268267 -0.00901 0.423212
C  -2.414999 -1.494939 -1.880458
C  -3.212497 2.464076 -1.392335
H  3.063293 -0.757497 -1.023599
H  2.967331 -1.416291 0.630136
H  1.277867 0.950396 -0.456537
H  1.1704 0.33211 1.185092
H  3.663994 0.773049 1.598607
H  -3.288107 -0.765186 1.458285
H  -1.338974 -2.818327 -0.586421
H  -2.766612 -2.056157 0.168495
H  -3.386646 2.326807 1.411419
H  -4.679397 1.203847 1.941517
H  -1.821269 1.16418 3.2011
H  -1.912876 -0.545435 3.374583
H  3.026632 2.424183 -0.176613
H  4.432667 1.890067 -1.050306
H  -3.867832 3.040497 -2.058522
H  -2.520608 1.809794 -1.949834
H  6.399256 -1.350638 1.314777
H  -3.681518 -2.202936 -3.209959
H  -1.812273 2.890637 -0.047265
