program: Gaussian 09
title: 000188322
version: EM64L-G09RevD.01
frameworkgroup: C1[X(C14H22N2O4S)]
method: RPBEPBE
basis: SDD
operation: Freq
keyword: #p
keyword: freq=noraman
keyword: PBEPBE/SDD
title: #p freq=noraman PBEPBE/SDD
converged: YES YES NO NO
title: Mulliken charges:
elementType: S O O O O N N C C C C C C C C C C C C C C H H H H H H H H H H H H H H H H H H H H H H
charge: 0.915859 -0.258359 -0.534808 -0.529967 -0.241372 -0.557209 -0.571361 -0.414820 -0.200347 -0.383597 -0.345671 0.229672 -0.398884 0.003617 -0.262557 -0.237403 0.453850 -0.383342 -0.342274 -0.799468 -0.502499 0.264053 0.220115 0.304356 0.211438 0.217788 0.228612 0.173433 0.334836 0.175770 0.215596 0.288985 0.277790 0.272447 0.256465 0.244527 0.242891 0.233793 0.241393 0.229539 0.237996 0.246441 0.242677
chargesum: 0.00000
title: Mulliken charges with hydrogens summed into heavy atoms:
elementType: S O O O O N N C C C C C C C C C C C C C C
charge: 0.915859 -0.258359 -0.534808 -0.529967 -0.241372 -0.222373 -0.042449 0.069348 0.104009 0.045629 0.056374 0.229672 -0.007517 0.003617 0.026428 0.040387 0.453850 -0.138814 -0.099383 -0.094744 0.224614
polarizability: 2.66040869e+02 -1.23703478e-02 1.95119550e+02 1.75586453e+01 1.80765541e+01 1.61205961e+02
1716.lowfreq: -14.3216 -5.8941 -0.0015 -0.0014 -0.0012 2.8316 9.3971 21.5603 28.3650
frequency: 6.0426 21.4225 28.3506 30.5394 32.9195 38.1545 50.0703 59.1863 77.5974 91.4007 97.1117 104.7924 129.3756 133.0643 144.9425 168.2804 179.6075 189.1965 223.3631 225.4163 244.1985 253.6016 283.4902 302.3863 314.1622 349.3246 358.1922 375.9754 391.7633 407.5041 433.3654 443.6457 485.3633 514.9598 570.9208 587.6097 596.7468 621.9822 646.3719 708.3644 729.2428 742.2648 757.9119 776.9306 796.2571 805.1726 827.0502 848.5565 848.9226 871.8227 912.8051 932.9732 962.1768 964.5526 966.7147 982.5562 988.8272 997.3412 1043.3151 1049.7551 1051.7331 1055.1888 1080.9380 1087.3638 1112.9778 1114.2507 1118.7048 1134.0304 1143.9206 1149.9820 1184.7385 1202.8282 1218.2061 1228.9226 1256.3451 1268.4699 1290.7228 1294.2680 1296.9338 1299.5489 1337.7867 1364.8541 1376.1986 1382.1558 1389.5629 1391.9055 1400.3678 1422.3161 1452.3811 1462.1854 1462.9002 1466.1489 1470.5895 1473.8331 1475.3688 1480.6946 1492.9190 1595.4706 1597.9252 1630.8606 1637.0233 2857.4525 2955.7214 2968.7312 2981.3403 2986.5640 3007.7885 3014.3208 3018.2641 3044.2620 3057.6936 3062.4040 3068.4301 3092.9631 3111.2355 3136.2151 3138.7556 3154.7444 3161.3375 3167.4275 3384.1104 3455.2553 3583.8195
redmass: 4.8300 4.2279 3.8251 1.6245 1.9265 4.2283 1.9350 1.9807 1.6867 4.2148 3.7898 3.9245 4.2760 2.1369 4.7930 4.0119 6.1518 4.4992 3.0807 4.4156 1.5166 3.8785 4.8220 3.2207 4.2169 3.4480 4.6887 4.7496 5.1591 2.8846 4.2030 8.3272 3.4367 3.2873 2.4832 1.8335 2.8910 6.9464 3.9591 3.2827 3.1550 1.2620 2.6396 4.1314 1.6626 4.1517 1.3734 2.9026 1.2525 3.3722 1.7422 10.6172 1.3279 2.9713 1.9939 1.3909 1.7043 3.2073 3.9135 1.6090 2.4197 2.4561 2.2619 3.5868 1.2754 2.3583 1.2862 2.3304 1.6021 1.5171 1.1456 1.3015 2.9956 1.3487 1.4004 1.3610 1.0600 1.2531 1.2638 1.2097 1.3566 1.5190 1.2822 4.4378 1.4521 2.9482 1.2752 1.1950 1.0500 1.0769 1.0566 1.0666 1.0726 2.2430 1.1124 1.0916 1.0900 6.3519 6.5790 8.9685 1.0951 1.0717 1.0653 1.0599 1.0384 1.0601 1.0294 1.0862 1.0972 1.1006 1.1027 1.0958 1.0851 1.0996 1.1048 1.0895 1.0890 1.1050 1.0959 1.0963 1.0744 1.0447 1.0977
irintensity: 1.6637 0.4284 0.7083 1.0044 0.2120 2.5978 2.1388 2.6176 2.3067 1.6056 1.0037 0.0865 2.3749 1.9352 1.9062 3.7425 2.3230 2.7962 23.9000 20.0478 21.0398 33.2898 11.7462 9.4963 2.8427 5.5169 7.4141 3.3764 0.8208 0.3380 36.4156 133.1745 4.7555 78.4555 64.6274 169.4288 27.6054 0.3078 48.9915 1.1154 47.9387 10.3014 57.6857 11.2170 41.9765 49.2897 37.7956 9.8532 2.5616 4.4113 1.9487 72.0664 1.3738 10.4303 2.8224 0.3089 2.0090 6.7254 5.9371 18.5809 57.2390 14.1593 6.0746 23.7107 0.3014 34.6077 6.8346 264.2485 29.5259 36.8518 10.6635 6.8076 5.6278 37.4562 43.6712 33.2478 6.4836 16.8939 2.3422 3.4562 10.4249 7.2833 4.7315 4.0409 15.9906 10.3578 14.6615 19.0003 14.7079 3.9939 11.2817 8.4915 16.0933 26.8375 14.1315 7.0510 6.3181 5.7314 3.2171 135.2510 40.6257 112.7803 25.1701 17.7529 25.4650 27.4114 33.0181 26.1073 3.5845 4.7338 82.9802 18.0913 7.0967 15.7901 23.4090 12.9390 8.1295 13.8331 5.6909 6.4337 32.5242 1.9318 0.1871
temp: 298.150 k
press: 1.00000 atm
elementType: 16 8 8 8 8 7 7 6 6 6 6 6 6 6 6 6 6 6 6 6 6 1 1 1 1 1 1 1 1 1 1 1 1 1 1 1 1 1 1 1 1 1 1
symmnumber: 1
zpe: 906101.1 jmol-1
zpe.correction: 0.345116 hartree
zpe.thermalcorrener: 0.370250 hartree
zpe.thermalcorrenthalpy: 0.371194 hartree
zpe.thermalcorrgfe: 0.284316 hartree
zpe.sumelectzpe: -1353.334253 hartree
zpe.sumelectthermal: -1353.309119 hartree
zpe.sumelectthermalent: -1353.308175 hartree
zpe.sumelectthermalfe: -1353.395053 hartree
dipole: -1.6657 3.6580 -3.3616
dipole: 5.2399
quadrupole: -89.3138 -128.9291 -143.3242
quadrupole: 7.5504 0.3401 11.7395
quadrupole: 31.2086 -8.4067 -22.8019 7.5504 0.3401 11.7395
hfenergy: -1353.6793688 hartree
pointgroup: C01 [X(C14H22N2O4S1)]
dipole: -0.9375662 1.6663252 -0.7708389 debye
polarizability: 264.5509978|8.3476341|179.7527538|14.8626949|27.5783672|178.0626284 unknown
InChI: InChI=1S/C14H22N2O4S/c1-11-6-8-12(9-7-11)21(18,19)16-13(14(17)20-2)5-3-4-10-15/h6-9,13,16H,3-5,10,15H2,1-2H3
charge 0 multiplicity 1
43 atoms
S  -0.460419 -0.808295 0.696256
O  1.95977 3.630635 1.688309
O  -0.38029 -0.908964 2.320157
O  0.282213 -1.908743 -0.257803
O  1.415437 3.18807 -0.534093
N  0.094549 0.912601 0.313364
N  6.403518 -1.556214 -1.176853
C  2.506777 0.55441 1.21819
C  1.197634 1.411907 1.182301
C  3.129203 0.234327 -0.158515
C  4.474147 -0.513269 -0.009609
C  1.504682 2.8163 0.65906
C  5.100272 -0.887933 -1.368318
C  -2.263756 -0.732906 0.160948
C  -2.609098 -1.323741 -1.062878
C  -3.193323 -0.130618 1.023943
C  -4.950736 -0.685696 -0.618118
C  -3.969873 -1.292427 -1.444657
C  -4.544669 -0.115098 0.619688
C  -6.406545 -0.637833 -1.044197
C  2.369553 5.002846 1.292111
H  2.263873 -0.387197 1.747296
H  3.237556 1.095157 1.851804
H  0.808037 1.494201 2.210077
H  3.287042 1.165261 -0.740013
H  2.433036 -0.402377 -0.740244
H  4.3362 -1.441107 0.577082
H  5.187926 0.121674 0.559101
H  0.32165 0.971076 -0.697263
H  5.151475 0.032003 -2.004318
H  4.426058 -1.595898 -1.887442
H  -1.844881 -1.811474 -1.676746
H  -2.874034 0.291847 1.981603
H  6.780521 -2.007141 -2.015602
H  7.103507 -0.972599 -0.707405
H  -4.270802 -1.749369 -2.394026
H  -5.29486 0.34412 1.273787
H  -7.080624 -0.89481 -0.207601
H  -6.684024 0.377977 -1.385498
H  -6.610754 -1.334649 -1.874508
H  2.720593 5.467925 2.223308
H  1.507242 5.547621 0.873435
H  3.173123 4.958103 0.538191
