program: Gaussian 09
title: 000188318
version: EM64L-G09RevD.01
frameworkgroup: C1[X(C6H15N3)]
method: RPBEPBE
basis: SDD
operation: Freq
keyword: #pfreq=noraman
keyword: PBEPBE/SDD
title: #p freq=noraman PBEPBE/SDD
converged: YES YES NO NO
title: Mulliken charges:
elementType: N N N C C C C C C H H H H H H H H H H H H H H H
charge: -0.345867 -0.273882 -0.328289 -0.421941 -0.353629 -0.342545 -0.350521 -0.415552 -0.394392 0.189908 0.219422 0.203801 0.208692 0.212480 0.168945 0.174978 0.198306 0.197131 0.214291 0.202296 0.199490 0.267219 0.301830 0.267830
chargesum: 0.00000
title: Mulliken charges with hydrogens summed into heavy atoms:
elementType: N N N C C C C C C
charge: -0.078648 0.027948 -0.060459 -0.012611 0.058864 0.038879 0.022763 -0.004129 0.007393
polarizability: 9.19303869e+01 -1.98155729e-01 9.08584134e+01 9.75620529e-01 -9.96069205e-01 7.07244925e+01
1716.lowfreq: -5.8430 0.0002 0.0006 0.0007 18.8759 24.3062 150.9633 177.0994 186.5213
frequency: 150.9051 177.0553 186.4257 205.2445 258.5276 282.8781 299.2644 311.9092 373.5470 397.1476 438.1904 516.2193 548.5195 600.2073 758.4278 791.8956 816.1151 831.5399 867.0909 876.1862 924.6049 970.7768 1003.0346 1036.5452 1065.0743 1098.6108 1127.2321 1159.4241 1166.7556 1184.2621 1203.5169 1223.5527 1235.9450 1254.0541 1258.3316 1288.3977 1325.8758 1333.8501 1345.9493 1352.6976 1356.3627 1373.8168 1446.0380 1449.3244 1458.7201 1465.1308 1466.5298 1471.6464 1476.0549 1506.0617 1508.6559 2833.9250 2875.2479 2891.6495 2919.7135 2928.2118 2972.6601 2977.8539 3005.8745 3021.0731 3027.1765 3036.5651 3043.7906 3298.9796 3539.2731 3543.8444
redmass: 2.4305 2.2827 3.9118 3.0311 1.9638 1.4816 1.5814 3.2919 1.9080 1.7421 1.5639 2.2412 1.9669 2.9585 2.5495 2.1678 2.1307 1.5983 2.1176 1.7788 2.1281 2.5381 2.2890 1.8416 1.9862 1.9445 1.8650 2.9636 1.9921 2.3948 1.5596 1.3629 1.2640 1.1820 1.1398 1.3322 1.2627 1.2884 1.2437 1.2378 1.3172 1.3061 1.2238 1.1600 1.1115 1.1096 1.1168 1.1279 1.1221 1.0819 1.1362 1.0704 1.0692 1.0724 1.0708 1.0682 1.0853 1.0629 1.0862 1.0948 1.0899 1.0926 1.0996 1.0709 1.0763 1.0765
irintensity: 3.3634 2.3255 4.0852 2.4924 4.9591 60.0899 54.1283 6.4225 2.3580 13.0319 74.9783 14.5727 27.0084 14.4416 80.8525 0.8243 2.0171 21.1115 2.3560 6.9245 44.5783 3.0002 2.9283 7.7217 36.2630 17.0741 7.3820 9.0154 45.9444 33.8552 16.8937 35.1740 17.1344 4.6823 2.1929 2.5952 2.7174 4.6042 6.0570 7.5683 5.5084 5.2304 6.2941 8.0024 3.4124 6.7271 2.1701 8.6520 8.6569 34.3967 21.7354 144.8765 66.7663 126.8176 137.7982 96.6505 90.5670 89.1638 17.3273 28.7971 41.5443 26.2668 98.2209 33.0656 0.8895 1.3125
temp: 298.150 k
press: 1.00000 atm
elementType: 7 7 7 6 6 6 6 6 6 1 1 1 1 1 1 1 1 1 1 1 1 1 1 1
symmnumber: 1
zpe: 569063.4 jmol-1
zpe.correction: 0.216745 hartree
zpe.thermalcorrener: 0.226097 hartree
zpe.thermalcorrenthalpy: 0.227041 hartree
zpe.thermalcorrgfe: 0.183512 hartree
zpe.sumelectzpe: -401.079733 hartree
zpe.sumelectthermal: -401.070381 hartree
zpe.sumelectthermalent: -401.069437 hartree
zpe.sumelectthermalfe: -401.112966 hartree
dipole: -0.1897 2.4967 0.9368
dipole: 2.6734
quadrupole: -51.0551 -58.9940 -56.6397
quadrupole: 1.5112 0.4745 -4.5944
quadrupole: 4.5078 -3.4310 -1.0768 1.5112 0.4745 -4.5944
hfenergy: -401.2964781 hartree
pointgroup: C01 [X(C6H15N3)]
dipole: 0.7635823 -0.6293189 0.3566114 debye
dipolederiv: -0.7967784 -0.0353961 0.0789497 0.0048637 -0.5005924 0.1477615 -0.0833744 0.215963 -0.4553595 -0.6593584 0.0006059 -0.1742116 -0.1186613 -0.6316093 0.1312179 -0.0957464 0.0294258 -0.4861628 -0.5738597 0.1421874 -0.1700182 0.1765676 -0.6897228 0.0071374 -0.1484523 -0.1150646 -0.4442844 0.5815369 -0.0375265 -0.1594607 -0.1586599 0.2564302 -0.0393318 -0.2053888 -0.0732154 0.3053371 0.5059789 -0.0525292 0.1726009 0.086756 0.259236 -0.0041929 0.2260808 -0.0771447 0.2199121 0.4167474 0.0996777 -0.0510411 0.1344693 0.1263514 -0.141808 -0.0702131 -0.1717489 0.3344684 0.2289127 -0.0818195 0.1209577 -0.2161285 0.6117684 -0.1223998 0.2114403 -0.1474833 0.3123746 0.3408672 0.0836883 0.05979 0.1259188 0.4074726 -0.0285682 0.0668102 0.065182 0.2271454 0.2530524 -0.1609363 -0.1149278 -0.0286472 0.3492441 0.1437249 -0.0864159 0.1969757 0.1989868 -0.0938933 -0.0450989 0.0848199 -0.0932725 -0.0994724 0.1187727 0.2152118 0.1466476 -0.1194803 -0.065795 -0.0122928 -0.0833354 -0.0133765 0.0675949 -0.021689 -0.1314711 -0.0815681 -0.0794497 -0.0861849 0.094355 -0.0824586 0.1150853 -0.2076815 0.108035 -0.0734383 0.0630294 0.0487079 0.0072224 -0.0031668 0.0817922 0.000275 0.0724202 -0.1133603 0.039428 -0.0773021 -0.0868654 -0.2473395 0.0058602 0.104803 0.0390948 0.0155478 -0.0043332 0.0651283 0.0325511 0.0363513 -0.0093364 -0.0215396 -0.1538661 -0.0318014 -0.0018973 0.0067136 -0.0830847 0.0613341 -0.2199476 -0.1870145 0.0714491 -0.149446 0.0270318 -0.0622797 0.0276039 -0.250067 0.1375841 -0.1294406 0.0225215 0.0637714 0.0600059 0.0641782 -0.0415971 -0.076105 0.1292392 -0.0898228 -0.0935289 -0.0325791 0.1080826 0.0771299 0.0556318 -0.0275855 -0.0809832 0.0696422 -0.1645184 -0.054688 0.001763 -0.0992291 0.0374069 -0.0514851 -0.0885211 0.1117019 0.0222699 0.168308 -0.0631406 -0.1236528 -0.1559067 -0.0622863 -0.1021453 -0.1954201 -0.1166502 -0.0288896 -0.0930231 0.0418673 0.0599562 0.0284258 0.0571829 0.028846 0.0025264 0.1334298 0.0363262 0.0841875 -0.1013764 0.0729949 0.0577317 -0.0253266 0.0364648 0.1229514 -0.1607834 -0.0395569 -0.1102206 0.1952848 0.2257404 -0.046906 0.1346934 -0.0615828 0.2175175 -0.0753275 0.0868165 -0.0093221 0.2196728 0.1584981 -0.0034875 0.1562463 -0.0194226 0.0373183 0.0494339 0.1277049 0.0092459 0.1936157 unknown
polarizability: 91.5481426|0.5596499|91.2176591|-1.5390986|0.1902165|70.7474912 unknown
InChI: InChI=1S/C6H15N3/c1-2-8-5-6-9-4-3-7-1/h7-9H,1-6H2
charge 0 multiplicity 1
24 atoms
N  -0.355136 -1.698968 -0.433925
N  -1.197312 1.015067 -0.528107
N  1.647091 0.601532 -0.407321
C  -1.71082 -1.353712 0.031151
C  0.775564 -1.613877 0.497804
C  -1.78875 0.127033 0.498414
C  1.985863 -0.769938 -0.010032
C  -0.323005 2.089877 -0.010942
C  1.037277 1.5420 0.548217
H  -2.084677 -2.000478 0.861712
H  -2.395649 -1.491153 -0.827425
H  1.179631 -2.616179 0.769638
H  0.409457 -1.174875 1.444993
H  -2.853905 0.375312 0.684378
H  -1.274031 0.219475 1.48535
H  2.762973 -0.822163 0.79752
H  2.416012 -1.273499 -0.898247
H  -0.851279 2.66877 0.772221
H  -0.108011 2.788941 -0.843107
H  1.710677 2.39316 0.794529
H  0.852842 1.009313 1.500668
H  -0.308407 -2.455804 -1.117625
H  -0.601691 0.418507 -1.136324
H  2.284489 1.021958 -1.085439
