program: Gaussian 09
title: 000017395
version: EM64L-G09RevD.01
frameworkgroup: C1[X(C18H22N2)]
method: RPBEPBE
basis: SDD
operation: Freq
keyword: #pfreq=noraman
keyword: PBEPBE/SDD
title: #p freq=noraman PBEPBE/SDD
converged: YES YES NO NO
title: Mulliken charges:
elementType: N N C C C C C C C C C C C C C C C C C C H H H H H H H H H H H H H H H H H H H H H H
charge: -0.124423 -0.016127 -0.494503 -0.370261 -0.198229 0.350734 -0.317118 -0.316977 0.171807 0.416005 -0.410742 -0.674453 -0.670811 -0.204753 -0.365702 -0.459497 -0.262165 -0.430916 -0.267495 -0.241934 0.217894 0.225052 0.226969 0.202971 0.282100 0.192045 0.208465 0.187426 0.203329 0.232521 0.223687 0.209893 0.211340 0.230909 0.217938 0.207548 0.239941 0.240662 0.228186 0.238855 0.229677 0.230152
chargesum: 0.00000
title: Mulliken charges with hydrogens summed into heavy atoms:
elementType: N N C C C C C C C C C C C C C C C C C C
charge: -0.124423 -0.016127 -0.051558 0.059679 0.083871 0.350734 0.083392 0.073779 0.171807 0.416005 -0.178221 -0.029533 -0.014416 -0.204753 -0.125761 -0.218836 -0.033980 -0.192061 -0.037818 -0.011782
polarizability: 2.19937735e+02 2.94581907e+01 1.88057001e+02 7.90648275e+00 -2.28472579e+01 2.04113345e+02
1716.lowfreq: -8.8256 -2.7056 -0.0006 -0.0005 0.0002 15.2741 21.2374 30.2199 39.8469
frequency: 21.0962 29.9741 39.5891 52.7357 77.3128 77.9373 81.8276 113.9486 132.9238 161.3569 177.0171 202.1549 214.4635 235.3249 269.5642 291.7776 295.7992 335.0787 358.3858 391.6320 415.0333 424.5628 438.5204 461.5563 470.5466 494.9767 510.8497 524.5201 548.9806 565.2998 614.5038 655.6434 692.0323 721.6477 745.1787 785.3761 788.8929 790.4932 794.9488 804.0728 812.5603 875.9234 878.6081 903.6714 917.2671 920.6603 960.1562 971.6132 984.2211 994.0028 996.2964 1010.1807 1032.8469 1047.7591 1068.2168 1073.5910 1084.7157 1085.5761 1094.5599 1115.6983 1145.6638 1153.4890 1177.0527 1184.5552 1193.7726 1212.3758 1234.6898 1237.4010 1252.3998 1267.4998 1275.7578 1286.6262 1292.1559 1318.1955 1340.7668 1360.6696 1366.3925 1373.4472 1377.5562 1388.2462 1392.6706 1406.4744 1420.1778 1439.7508 1457.1982 1460.5498 1463.9147 1466.3084 1474.2670 1480.0701 1481.5443 1486.8887 1490.9846 1517.4151 1589.9563 1602.0007 1634.0852 2178.9950 2860.5536 2866.9660 2883.6406 2950.2069 2984.7286 2985.0900 3009.9461 3026.9383 3035.8416 3050.5831 3066.9072 3077.3585 3078.9933 3090.3419 3091.0939 3122.0583 3124.8068 3135.5591 3141.9533 3152.7606 3161.3119 3167.3490
redmass: 5.0149 4.1773 3.3923 2.9885 2.9176 4.7191 1.9227 5.9814 3.3664 2.4454 3.6822 1.4760 1.5494 3.3963 3.7368 1.9826 2.5239 2.3408 2.6002 5.5272 4.1686 2.9335 2.9710 2.5513 3.2312 4.4361 4.4957 5.5079 4.5382 3.8645 3.7557 4.3453 2.7237 2.9714 1.3962 4.5979 1.1868 1.9755 1.1819 2.8001 1.5985 1.7363 2.5407 1.9750 1.9963 1.5973 1.4934 2.8225 1.3802 1.3694 3.5646 2.1441 2.3704 2.3526 2.3012 1.9022 2.2061 2.0995 3.2048 1.8706 1.4925 1.3892 1.1093 1.3037 1.8181 1.6714 1.7409 2.1179 1.4122 1.6172 1.2716 1.2145 1.2219 1.3855 1.3889 1.3208 1.3112 1.4183 1.8865 1.2284 1.2261 2.9298 4.8953 2.5093 2.2742 1.0620 1.0529 1.1035 1.0678 1.0682 1.0554 1.0766 1.0765 3.7176 7.6115 5.2101 6.5111 12.5069 1.0721 1.0716 1.0716 1.0795 1.0357 1.0359 1.0610 1.0873 1.0877 1.0925 1.0964 1.0984 1.0982 1.1004 1.1003 1.0869 1.0862 1.0886 1.0912 1.0942 1.0981 1.0996
irintensity: 0.5118 0.2680 0.1702 0.8421 0.5248 1.6321 0.2533 1.9490 0.0221 1.1808 1.8777 0.4745 1.3168 2.1180 1.9488 0.7919 7.8618 1.0950 0.5113 3.2191 3.5823 6.9502 2.9406 3.9460 0.2195 0.7575 4.3193 0.8710 12.2800 1.8723 1.4951 3.7464 12.1229 3.0293 4.0814 3.7718 13.3566 65.2911 5.0859 9.1875 53.0661 6.0558 6.9190 0.2074 1.2981 0.5404 0.3281 8.3334 1.5516 0.4473 0.9582 5.9872 7.3754 5.5740 36.6808 13.0523 6.9233 1.0291 16.2648 12.0238 2.2403 6.7683 3.9219 7.0630 48.5538 10.4446 10.6404 16.3364 14.7223 3.4492 1.7227 5.9904 15.6656 16.0060 12.3459 3.3404 1.9392 2.1117 15.3687 22.5603 10.5010 2.2326 0.4600 4.7473 1.2762 2.7472 7.6387 0.5930 4.2536 5.4982 12.5559 23.9640 19.9728 10.2291 0.6609 6.0697 0.1431 26.3416 30.2854 113.9857 196.2930 24.6974 33.3573 15.3228 26.4198 15.8169 17.3161 7.6415 36.2227 46.6233 65.1175 49.8690 30.2565 1.5244 1.9572 6.0295 20.8270 35.8474 30.9513 17.4837
temp: 298.150 k
press: 1.00000 atm
elementType: 7 7 6 6 6 6 6 6 6 6 6 6 6 6 6 6 6 6 6 6 1 1 1 1 1 1 1 1 1 1 1 1 1 1 1 1 1 1 1 1 1 1
symmnumber: 1
zpe: 930590.7 jmol-1
zpe.correction: 0.354443 hartree
zpe.thermalcorrener: 0.374168 hartree
zpe.thermalcorrenthalpy: 0.375112 hartree
zpe.thermalcorrgfe: 0.304715 hartree
zpe.sumelectzpe: -807.124708 hartree
zpe.sumelectthermal: -807.104983 hartree
zpe.sumelectthermalent: -807.104039 hartree
zpe.sumelectthermalfe: -807.174436 hartree
dipole: 1.5491 -3.2823 -3.7021
dipole: 5.1845
quadrupole: -106.1616 -128.9130 -122.6641
quadrupole: 5.7531 2.4061 -16.3250
quadrupole: 13.0846 -9.6668 -3.4178 5.7531 2.4061 -16.3250
hfenergy: -807.4791509 hartree
pointgroup: C01 [X(C18H22N2)]
dipole: -0.5497694 -1.2138957 1.5442506 debye
polarizability: 217.7918893|-28.7875956|193.0514902|8.7312595|25.3505793|201.2647006 unknown
InChI: InChI=1S/C18H22N2/c1-3-20(4-2)13-12-16(14-19)18-11-7-9-15-8-5-6-10-17(15)18/h5-11,16H,3-4,12-13H2,1-2H3
charge 0 multiplicity 1
42 atoms
N  -2.827312 -0.492488 0.689371
N  -0.191803 2.800671 -2.56171
C  -1.694704 1.740727 0.445622
C  -2.236826 0.663581 1.41504
C  -0.609996 1.148327 -0.502099
C  0.728612 0.761238 0.160768
C  -4.215487 -0.21682 0.217534
C  -2.726003 -1.771217 1.450723
C  1.559095 -0.260153 -0.441944
C  2.811147 -0.618861 0.200295
C  1.16374 1.393113 1.330841
C  -4.620353 -1.067837 -1.000867
C  -1.302845 -2.359825 1.4679
C  -0.372379 2.057859 -1.643951
C  1.2082 -0.937031 -1.659577
C  3.207228 0.050076 1.40461
C  2.399544 1.042428 1.956768
C  3.638985 -1.634378 -0.383533
C  2.036631 -1.919907 -2.206443
C  3.262576 -2.277327 -1.563211
H  -1.309693 2.605743 1.015722
H  -2.519157 2.128288 -0.181243
H  -1.406421 0.293566 2.040842
H  -2.974932 1.13846 2.10675
H  -1.085004 0.223765 -0.895681
H  -4.955021 -0.360647 1.045165
H  -4.271578 0.85019 -0.067304
H  -3.097875 -1.644715 2.499067
H  -3.40046 -2.500155 0.966326
H  0.553812 2.178782 1.787513
H  -3.924122 -0.890242 -1.839143
H  -4.610035 -2.148932 -0.773412
H  -5.642943 -0.805862 -1.330474
H  -0.944093 -2.528667 0.437537
H  -0.578358 -1.694282 1.970587
H  -1.296609 -3.325866 2.006382
H  0.286313 -0.670594 -2.184998
H  4.156046 -0.227656 1.878729
H  2.704976 1.561255 2.87173
H  4.580387 -1.894911 0.114949
H  1.749713 -2.417886 -3.13906
H  3.902905 -3.049611 -2.003019
