program: Gaussian 09
title: 000188315
version: EM64L-G09RevD.01
frameworkgroup: C1[X(C6H12O6)]
method: RPBEPBE
basis: SDD
operation: Freq
keyword: #pfreq=noraman
keyword: PBEPBE/SDD
title: #p freq=noraman PBEPBE/SDD
converged: YES YES NO NO
title: Mulliken charges:
elementType: O O O O O O C C C C C C H H H H H H H H H H H H
charge: -0.551708 -0.441707 -0.445306 -0.457062 -0.392357 -0.295257 -0.099371 -0.093821 -0.135017 -0.504228 -0.389850 0.255290 0.234267 0.223571 0.204712 0.284917 0.254354 0.235942 0.219926 0.410841 0.355722 0.356966 0.381314 0.387860
chargesum: 0.00000
title: Mulliken charges with hydrogens summed into heavy atoms:
elementType: O O O O O O C C C C C C
charge: -0.140867 -0.085985 -0.088340 -0.075747 -0.004496 -0.295257 0.134896 0.129750 0.069695 0.035044 0.066018 0.255290
polarizability: 1.03221511e+02 1.73443763e+00 7.86451143e+01 2.29430241e+00 4.76250635e+00 7.20301157e+01
1716.lowfreq: -9.8950 -8.3201 -0.0005 -0.0004 -0.0003 9.9198 42.3271 56.7142 86.0897
frequency: 42.2739 56.3653 86.0883 101.4244 154.9756 196.0192 210.6914 252.7461 266.2163 307.3773 325.6166 345.1792 361.6247 471.0486 502.6083 513.2262 533.0957 547.4661 621.5146 664.3125 709.3601 724.7414 760.3869 801.5768 810.0294 828.7108 879.8837 884.0778 918.4847 936.7044 997.1390 1021.6311 1051.6385 1063.5552 1077.2764 1093.4992 1175.8110 1189.0215 1199.5749 1229.0968 1258.7558 1272.9367 1286.7551 1329.6471 1334.5821 1347.0541 1369.6575 1383.8146 1395.1721 1399.3182 1419.7679 1426.9801 1466.4072 1633.5301 2991.3080 2997.8536 3010.2051 3013.2750 3030.5924 3071.3232 3092.9903 3272.3038 3380.4384 3416.5909 3433.4682 3504.8278
redmass: 6.0318 5.5469 10.8991 5.4942 5.9440 4.2237 4.1516 4.3070 5.7665 5.3864 4.1296 5.1774 3.4701 2.7978 1.7058 1.3029 1.0802 3.9862 4.1398 1.3560 3.6745 1.9695 1.8154 3.0021 1.6080 2.2296 3.7126 2.6602 2.9107 2.6876 4.0758 3.1322 2.5870 2.3589 2.0128 2.1896 1.0964 1.1356 1.1919 1.3142 1.5986 1.2198 1.4160 1.5140 1.3757 1.3354 1.2479 1.2063 1.4061 1.4727 1.1192 1.2872 1.0767 6.8417 1.0668 1.0646 1.0854 1.0843 1.0858 1.0934 1.1007 1.0665 1.0645 1.0642 1.0643 1.0640
irintensity: 0.1505 1.3307 1.3495 10.8522 4.4960 8.8379 7.4495 2.3725 1.6964 14.3985 3.4283 3.4927 3.6210 12.0251 51.9038 86.2789 80.0095 60.3479 17.4660 127.6018 10.4574 90.1270 117.5430 47.1939 159.3142 148.7234 58.8900 15.3665 19.3672 7.7286 54.5310 24.6601 69.3090 141.2357 105.5676 134.2904 36.7853 54.1414 4.9661 7.7128 0.3854 43.9260 8.2494 31.3768 36.7227 9.6456 54.0172 62.2656 30.3654 14.1486 36.5342 180.5771 12.2687 199.3500 5.8849 25.7474 18.4432 23.3629 59.0633 2.3249 37.7895 498.0121 93.5718 46.6957 46.7122 34.3389
temp: 298.150 k
press: 1.00000 atm
elementType: 8 8 8 8 8 8 6 6 6 6 6 6 1 1 1 1 1 1 1 1 1 1 1 1
symmnumber: 1
zpe: 499151.6 jmol-1
zpe.correction: 0.190117 hartree
zpe.thermalcorrener: 0.202785 hartree
zpe.thermalcorrenthalpy: 0.203729 hartree
zpe.thermalcorrgfe: 0.150833 hartree
zpe.sumelectzpe: -686.184977 hartree
zpe.sumelectthermal: -686.172308 hartree
zpe.sumelectthermalent: -686.171364 hartree
zpe.sumelectthermalfe: -686.224260 hartree
dipole: 5.0967 0.3845 1.0693
dipole: 5.2219
quadrupole: -72.5357 -71.5247 -76.9793
quadrupole: -8.9080 1.5761 4.8109
quadrupole: 1.1442 2.1552 -3.2994 -8.9080 1.5761 4.8109
hfenergy: -686.3750935 hartree
pointgroup: C01 [X(C6H12O6)]
dipole: 2.0399886 -0.2380843 0.0500651 debye
dipolederiv: -0.8685709 -0.0971318 -0.037574 -0.1064131 -0.5955626 0.0847089 0.0097995 0.1185373 -0.7209874 -0.7061069 -0.0214072 0.0060152 0.1079846 -0.6753819 -0.0995791 0.0698512 -0.1261956 -0.3360865 -0.7472244 -0.1139672 -0.0085431 -0.2299358 -0.4939997 -0.1988456 -0.0521761 -0.170225 -0.5404032 -0.4913292 0.1023535 -0.0363922 0.1552914 -0.6837845 0.0604344 -0.0413608 0.04524 -0.6261814 -1.4425142 -0.0137915 0.0241772 -0.062792 -0.3767099 -0.0612853 0.0870519 -0.0753188 -0.2548345 -1.0868829 0.0102529 -0.0235611 0.16553 -0.392554 0.2142197 -0.3969934 0.2036388 -0.7524221 0.10592 0.0001712 -0.0354234 0.0798212 0.3156571 -0.1162831 0.0427741 -0.1737719 0.3366949 0.4964886 -0.1144249 -0.1122383 -0.2239961 0.4795095 0.0165941 -0.0648969 0.0420891 0.1773238 0.5081574 0.1784928 0.1171794 0.2462295 0.2497979 0.0766546 0.1169995 0.0806002 0.3520403 -0.1672061 0.0234562 0.0581301 -0.0788895 -0.0328369 0.1524055 0.0752716 0.1021264 -0.1826069 0.2122883 -0.0025132 0.0144363 -0.0984989 0.2727615 -0.1457807 0.0060808 -0.0836214 0.432571 1.7965033 0.0356535 -0.0089518 -0.0209025 0.3900888 -0.362885 0.2080931 -0.3281988 0.9335668 0.0073395 0.0818034 0.0260849 0.0760098 -0.0795117 -0.0360286 0.0583548 -0.0537274 -0.006559 0.0264599 -0.0218077 0.0725587 0.0063786 -0.0389113 0.0766357 0.04093 0.1052715 -0.0700074 0.0101574 0.020157 -0.0742118 0.0265385 -0.0138802 0.1044566 -0.0583473 0.0632073 -0.1023049 -0.0101314 -0.0427512 -0.0434089 -0.0488661 0.117618 -0.0451794 -0.0505465 -0.0156067 0.0334588 0.0827308 0.0078224 0.0515702 0.0448777 -0.0547474 -0.0167024 0.0499323 -0.0327949 0.0864533 -0.1115208 -0.0364286 0.1030197 -0.0431654 0.0654885 0.0653497 0.0500366 0.0411213 0.0104569 0.0774747 -0.0535592 -0.1023004 -0.0581454 -0.0576003 -0.0841386 -0.0785567 -0.0444675 -0.0535745 0.7507917 0.0361536 0.0266574 0.0547024 0.2704329 0.0123501 -0.0239264 0.0065962 0.3808929 0.3693381 0.065648 0.0189502 0.0578157 0.3210462 0.0617788 -0.015968 0.1094495 0.2142231 0.3398084 0.0151891 -0.0377443 0.0690744 0.3126372 0.1288956 -0.0445449 0.0746834 0.2679458 0.473019 -0.0713352 0.0190241 -0.1083416 0.3544963 0.0011281 0.0010492 0.0027681 0.2658909 0.3750095 0.011964 -0.0174541 -0.0103074 0.3459464 0.1110958 0.0110923 0.108599 0.1544493 unknown
polarizability: 103.5279598|0.3245879|72.0641332|0.9892619|-4.738955|78.3046481 unknown
InChI: InChI=1S/C6H12O6/c7-2-4(9)6(12)3(8)1-5(10)11/h3-4,6-10,12H,1-2H2
charge 0 multiplicity 1
24 atoms
O  -0.682764 0.671468 -0.95403
O  0.312687 1.351113 1.434188
O  -2.562959 -1.769851 -0.510919
O  -3.314739 0.865286 -0.508619
O  3.93964 0.255014 -0.412573
O  1.934102 0.712812 -1.439834
C  -0.512848 -0.480053 -0.034151
C  0.48119 -0.064662 1.102417
C  -1.915881 -0.899563 0.474697
C  1.971664 -0.371674 0.808878
C  -2.849779 0.300433 0.771427
C  2.554306 0.252774 -0.443246
H  -0.110867 -1.346724 -0.594767
H  0.226861 -0.630382 2.019012
H  -1.783971 -1.518399 1.382074
H  2.578658 -0.028832 1.66522
H  2.127534 -1.467783 0.736652
H  -3.75917 -0.051088 1.284203
H  -2.341353 1.060136 1.396543
H  0.187659 0.784241 -1.447382
H  -0.08576 1.774292 0.62068
H  -3.114406 -1.159086 -1.077856
H  -2.478944 1.125148 -0.996921
H  4.300641 0.648478 -1.254094
