program: Gaussian 09
title: 000188308
version: EM64L-G09RevD.01
frameworkgroup: C1[X(C15H12O6)]
method: RPBEPBE
basis: SDD
operation: Freq
keyword: #pfreq=noraman
keyword: PBEPBE/SDD
title: #p freq=noraman PBEPBE/SDD
converged: YES YES NO NO
title: Mulliken charges:
elementType: O O O O O O C C C C C C C C C C C C C C C H H H H H H H H H H H H
charge: -0.272972 -0.187366 -0.372221 -0.479753 -0.412243 -0.429934 -0.217860 -0.542888 0.142713 0.516939 0.095878 0.295890 0.135227 -0.570883 -0.436382 -0.346854 -0.259530 0.313454 -0.344052 -0.388848 0.282628 0.238303 0.259845 0.252985 0.284826 0.236398 0.250373 0.253637 0.220572 0.371288 0.381494 0.373836 0.355501
chargesum: 0.00000
title: Mulliken charges with hydrogens summed into heavy atoms:
elementType: O O O O O O C C C C C C C C C C C C C C C
charge: -0.272972 -0.187366 -0.000932 -0.098259 -0.038408 -0.074433 0.020443 -0.030059 0.142713 0.516939 0.095878 0.295890 0.135227 -0.286057 -0.199984 -0.096481 -0.259530 0.313454 -0.090415 -0.168276 0.282628
polarizability: 2.88492953e+02 -3.91305290e+00 1.74473622e+02 2.53843023e-01 1.04213096e+01 1.16212086e+02
1716.lowfreq: -9.2481 -5.3498 -0.0007 -0.0003 0.0004 5.5313 13.9324 33.0285 47.2200
frequency: 12.1501 32.9984 47.2112 70.9874 93.4176 136.3941 157.1133 172.6534 203.3047 234.5451 246.1732 249.1233 267.0406 301.7279 331.1551 342.1554 349.3034 361.7088 382.8404 389.6185 409.5867 419.3454 474.3739 491.3545 512.8810 527.4803 552.6627 559.2131 579.6875 595.8403 620.6769 622.8599 634.2584 647.7323 666.8602 670.8074 731.9860 750.4298 785.7056 810.0888 821.7071 832.3506 840.0257 849.1989 879.8324 938.5012 959.5403 964.6682 1004.1108 1029.1560 1042.0253 1063.3853 1090.3052 1102.4222 1130.9949 1144.4792 1163.0734 1168.8079 1178.7922 1202.8796 1219.7753 1236.9349 1249.3489 1253.0435 1285.6293 1304.1678 1316.0227 1347.3818 1367.1962 1394.9991 1404.6792 1426.5943 1429.9710 1440.0201 1486.3477 1507.6380 1580.9468 1591.0331 1600.0752 1628.5114 1635.7422 2975.5708 2995.0945 3082.4189 3115.2354 3126.9072 3154.3326 3172.8678 3196.9712 3450.0683 3499.4085 3503.9555 3581.7281
redmass: 4.0877 6.6694 7.0066 8.9769 4.0504 6.0339 6.2984 7.3315 8.0673 8.5984 4.6960 4.7675 5.2811 4.9038 1.7352 3.7721 4.4525 1.1165 7.5124 3.9174 2.9731 5.4626 8.1371 3.6729 3.2881 4.9204 1.1518 3.5677 4.0989 5.3933 1.2774 3.2094 6.9372 5.2590 5.1782 5.3794 3.8123 4.3545 5.3591 1.3622 6.0844 1.6478 2.5205 2.1693 4.0419 1.3726 1.3979 2.8085 2.7808 6.2668 6.8003 3.6993 2.9065 1.4487 1.5249 1.3477 1.4288 1.3503 1.1116 1.7308 1.7629 1.9725 2.1182 1.7370 2.9874 1.3664 1.3755 1.7392 3.8268 6.3908 4.7522 1.1678 2.4553 5.1375 4.6389 2.8593 7.9316 10.7366 6.4960 6.4027 7.4882 1.0829 1.0665 1.0965 1.0893 1.0900 1.0949 1.0953 1.0929 1.0641 1.0648 1.0665 1.0660
irintensity: 1.0999 1.9190 0.4473 3.0198 8.0162 0.4892 1.1780 1.3099 0.1252 0.8908 33.2378 16.6163 7.2415 12.1606 30.2998 2.1712 14.4636 142.4126 7.8746 6.8888 1.8100 3.2063 3.6134 9.7034 38.7600 39.2744 243.3167 3.5773 3.0856 1.4049 38.2442 1.8776 0.3266 4.2700 14.6334 21.8758 1.6110 5.0156 31.9354 20.9735 28.2539 70.8024 8.2230 30.3335 125.6230 0.1480 1.2040 22.0018 5.9631 101.1766 120.7354 51.8027 11.5214 51.3389 385.4088 212.2370 60.4176 25.5912 13.0978 124.9309 14.7190 144.4893 28.3317 4.7085 28.9999 100.8697 6.0819 135.6513 9.0502 8.5790 16.8551 10.0852 15.8903 301.8961 8.6287 75.7561 29.2056 474.4710 27.3136 83.7856 255.1947 16.9868 12.2666 6.8641 22.3813 10.2978 7.5091 5.7784 0.3830 57.3191 104.4246 11.7875 48.3829
temp: 298.150 k
press: 1.00000 atm
elementType: 8 8 8 8 8 8 6 6 6 6 6 6 6 6 6 6 6 6 6 6 6 1 1 1 1 1 1 1 1 1 1 1 1
symmnumber: 1
zpe: 630505.7 jmol-1
zpe.correction: 0.240147 hartree
zpe.thermalcorrener: 0.258383 hartree
zpe.thermalcorrenthalpy: 0.259327 hartree
zpe.thermalcorrgfe: 0.192604 hartree
zpe.sumelectzpe: -1028.620092 hartree
zpe.sumelectthermal: -1028.601857 hartree
zpe.sumelectthermalent: -1028.600913 hartree
zpe.sumelectthermalfe: -1028.667635 hartree
dipole: 1.4169 -2.9417 -2.1386
dipole: 3.9032
quadrupole: -87.9694 -139.3130 -112.2930
quadrupole: -3.6174 2.2360 7.3695
quadrupole: 25.2224 -26.1212 0.8988 -3.6174 2.2360 7.3695
hfenergy: -1028.8602394 hartree
pointgroup: C01 [X(C15H12O6)]
dipole: 0.5503198 -1.0442681 -0.9822498 debye
polarizability: 288.4091828|-5.0540214|170.919711|0.3521703|17.5176015|119.8497683 unknown
InChI: InChI=1S/C15H12O6/c16-8-3-1-7(2-4-8)11-5-9(17)13-12(21-11)6-10(18)14(19)15(13)20/h1-4,6,11,16,18-20H,5H2
charge 0 multiplicity 1
33 atoms
O  -0.19549 -0.780056 -0.039514
O  1.44946 3.082493 0.10173
O  3.952595 1.874109 0.262825
O  5.419781 -0.473149 0.004412
O  4.068723 -2.941312 -0.166265
O  -6.593111 -0.606621 -0.298227
C  -0.986414 0.372009 0.509997
C  -0.50791 1.663652 -0.172525
C  1.821882 0.671974 0.065414
C  -2.449613 0.062229 0.287303
C  0.996655 1.903828 0.030406
C  1.193494 -0.621225 -0.029613
C  3.252475 0.686158 0.104717
C  1.923219 -1.823718 -0.114106
C  -3.394218 0.291285 1.318407
C  -2.908466 -0.412292 -0.965736
C  3.982651 -0.511379 -0.050551
C  3.327388 -1.764234 -0.11298
C  -4.769721 0.071246 1.107851
C  -4.280062 -0.650092 -1.187907
C  -5.211341 -0.399836 -0.149441
H  -0.7659 0.424514 1.596694
H  -1.057887 2.537177 0.216889
H  -0.715426 1.600799 -1.25984
H  1.403451 -2.782703 -0.143871
H  -3.054433 0.646438 2.298935
H  -2.184949 -0.623218 -1.760206
H  -5.50623 0.247606 1.896888
H  -4.622287 -1.02909 -2.159875
H  4.915993 1.646268 0.390406
H  5.793392 -0.364095 -0.909602
H  5.024729 -2.725392 0.005881
H  -6.805832 -0.939171 -1.205396
