program: Gaussian 09
title: 000188297
version: EM64L-G09RevD.01
frameworkgroup: C1[X(C15H20O3)]
method: RPBEPBE
basis: SDD
operation: Freq
keyword: #pfreq=noraman
keyword: PBEPBE/SDD
title: #p freq=noraman PBEPBE/SDD
converged: YES YES NO NO
title: Mulliken charges:
elementType: O O O C C C C C C C C C C C C C C C H H H H H H H H H H H H H H H H H H H H
charge: -0.244575 -0.434353 -0.194039 0.412067 -0.264548 -0.161318 -0.510671 -0.125612 -0.209273 -0.482134 0.394342 -0.828683 -0.512289 0.286034 -0.402765 0.074453 -0.812345 -0.697244 0.225902 0.263475 0.241290 0.212554 0.239379 0.252885 0.210666 0.219303 0.252561 0.226786 0.205568 0.236425 0.201831 0.216979 0.245414 0.211771 0.233981 0.327386 0.229843 0.258956
chargesum: 0.00000
title: Mulliken charges with hydrogens summed into heavy atoms:
elementType: O O O C C C C C C C C C C C C C C C
charge: -0.244575 -0.106967 -0.194039 0.412067 -0.038646 0.102157 -0.056827 0.113767 0.043612 -0.052165 0.394342 -0.143768 -0.074032 0.286034 -0.185786 0.074453 -0.121180 -0.208446
polarizability: 2.14873113e+02 6.46657693e+00 1.66247580e+02 -3.63198908e-01 -2.01844607e+00 1.11994675e+02
1716.lowfreq: -7.9456 0.0006 0.0007 0.0008 4.4522 14.4878 51.5955 70.8921 101.1053
frequency: 51.5385 70.8568 101.0629 132.3519 145.5636 183.8564 209.5411 216.3172 240.4453 246.3798 251.8064 265.7709 284.9655 288.9006 299.3207 304.6129 336.3727 364.3442 382.7780 402.4795 411.9485 443.4787 471.9541 486.4981 532.3041 568.3859 589.7562 618.2187 636.5840 663.2896 688.1408 726.8060 776.4026 787.7419 799.7279 834.6630 840.1195 870.3016 878.7768 915.4595 929.1247 952.7090 967.4064 976.8199 980.2702 998.0444 1001.4842 1025.8873 1034.0852 1045.2516 1061.1201 1088.8936 1096.3523 1122.8195 1127.1249 1133.9323 1157.4037 1164.9858 1189.1749 1209.6166 1219.0036 1237.6113 1240.5334 1251.3267 1275.1756 1292.9792 1300.5707 1319.8985 1324.5544 1327.9745 1338.0300 1348.7505 1356.0095 1369.6821 1379.9749 1390.6385 1406.1323 1420.9617 1453.8475 1457.1087 1462.6735 1466.5975 1473.7126 1487.3352 1500.9518 1680.3189 1683.8249 1692.4395 2916.9040 2917.7137 2921.7093 2969.2204 2979.7274 2981.6384 2990.7950 3005.4469 3007.4502 3025.6628 3044.4310 3057.8168 3059.0322 3066.7362 3083.3129 3091.0727 3097.2095 3104.1238 3205.8776 3549.6733
redmass: 4.0752 3.9573 4.2772 5.1895 5.1730 2.0498 1.9880 1.2440 4.6068 3.4969 1.4688 2.3617 2.4613 1.8890 1.6612 3.1281 2.4678 3.0963 3.7518 3.9915 3.3790 3.1133 3.2374 4.3600 3.1273 2.6951 3.4070 3.2824 3.3672 3.9055 2.9722 2.5913 3.7099 2.2499 1.6539 1.9829 2.1025 2.2393 2.6972 2.6263 2.3753 1.9143 1.9796 2.5100 1.4818 2.0542 2.1430 2.8769 2.7381 1.6363 1.7571 2.2421 1.9637 2.3611 1.8469 1.9188 1.4895 1.7292 2.1358 1.7037 1.6082 1.6629 1.7119 1.7664 1.6010 1.2652 1.3192 1.4980 1.6397 1.4470 1.5915 1.4342 1.8967 1.3177 1.2476 1.2098 1.2206 1.1816 1.0820 1.0463 1.0848 1.0658 1.0894 1.0636 1.0500 6.9634 7.3450 10.8724 1.0794 1.0714 1.0788 1.0665 1.0362 1.0391 1.0606 1.0854 1.0858 1.0890 1.0999 1.0968 1.0961 1.0941 1.1010 1.0990 1.0617 1.0907 1.1154 1.0657
irintensity: 2.0688 2.3174 1.9263 0.3916 4.3323 0.9279 1.5767 1.5200 0.4650 0.6158 13.1972 43.3800 18.5755 13.3813 53.1354 0.9485 1.1845 2.5422 0.9118 4.6387 2.0494 1.4151 9.4259 11.2034 1.1640 5.2512 4.3987 4.0751 1.6002 4.9189 6.5673 7.3478 11.7504 5.5311 14.6297 65.9890 0.5327 1.0747 39.3224 96.3538 46.6403 19.8680 7.2052 54.4974 53.6131 7.5165 43.4878 111.1885 78.5531 8.8275 6.2513 3.9499 0.9102 11.4281 5.2395 38.7770 3.1652 1.2376 1.8515 10.9997 28.7596 21.4541 17.6397 27.1875 3.5428 1.2463 17.9902 1.8846 3.8651 3.3460 3.0057 5.5614 1.4705 9.3021 22.8727 29.2341 14.1924 24.8240 8.5563 15.7466 10.2461 28.1158 8.5699 11.0618 5.4746 2.7800 54.1754 252.2187 7.4685 31.7777 26.8153 25.3282 23.7106 21.1903 27.9509 14.0609 28.6910 38.3823 35.5121 30.6857 19.8751 28.8867 31.5300 23.2374 4.6338 38.4454 3.5282 5.9767
temp: 298.150 k
press: 1.00000 atm
elementType: 8 8 8 6 6 6 6 6 6 6 6 6 6 6 6 6 6 6 1 1 1 1 1 1 1 1 1 1 1 1 1 1 1 1 1 1 1 1
symmnumber: 1
zpe: 836288.4 jmol-1
zpe.correction: 0.318525 hartree
zpe.thermalcorrener: 0.335337 hartree
zpe.thermalcorrenthalpy: 0.336281 hartree
zpe.thermalcorrgfe: 0.276040 hartree
zpe.sumelectzpe: -807.865477 hartree
zpe.sumelectthermal: -807.848666 hartree
zpe.sumelectthermalent: -807.847722 hartree
zpe.sumelectthermalfe: -807.907963 hartree
dipole: 3.1679 -2.8282 1.6452
dipole: 4.5543
quadrupole: -121.3401 -110.8208 -106.6561
quadrupole: 18.6432 3.8554 -2.1480
quadrupole: -8.4011 2.1182 6.2829 18.6432 3.8554 -2.1480
hfenergy: -808.1840029 hartree
pointgroup: C01 [X(C15H20O3)]
dipole: 1.2291343 1.1361314 -0.6394757 debye
polarizability: 215.0602532|-5.7192394|166.0854169|0.3577488|-1.6429004|111.9696977 unknown
InChI: InChI=1S/C15H20O3/c1-8-4-5-11(16)15(3)7-6-10-9(2)14(17)18-13(10)12(8)15/h4,10-13,16H,2,5-7H2,1,3H3
charge 0 multiplicity 1
38 atoms
O  -1.848194 -1.355034 0.110119
O  3.670303 1.79176 0.461918
O  -4.186375 -1.396504 0.156587
C  1.437563 0.760344 -0.135743
C  0.57881 -0.502721 0.304378
C  -0.835255 -0.294241 -0.252641
C  0.764175 2.085833 0.344577
C  -1.471487 0.991831 0.330707
C  2.813306 0.59715 0.588848
C  -0.710445 2.24604 -0.112781
C  1.291999 -1.823994 -0.02161
C  1.65332 0.817201 -1.673491
C  3.563738 -0.667478 0.123507
C  -2.937477 0.760835 0.037898
C  2.6536 -1.866248 -0.057618
C  -3.137054 -0.734305 0.098234
C  0.469314 -3.085113 -0.203783
C  -3.94353 1.630879 -0.216031
H  0.47959 -0.454915 1.413732
H  -0.824547 -0.262229 -1.358993
H  1.376174 2.936698 -0.003696
H  0.796112 2.118779 1.453912
H  -1.354233 0.907604 1.436226
H  2.620759 0.542779 1.676918
H  -1.145314 3.153498 0.347718
H  -0.783812 2.378579 -1.209419
H  1.991164 -0.151571 -2.079564
H  0.733957 1.101897 -2.21281
H  2.409393 1.587284 -1.920602
H  4.372722 -0.896394 0.844172
H  4.077196 -0.451762 -0.842153
H  3.148782 -2.829386 -0.244313
H  -0.171839 -3.279445 0.675428
H  1.125187 -3.958616 -0.365089
H  -0.225119 -3.005328 -1.060261
H  4.127182 1.761608 -0.417165
H  -3.778574 2.713546 -0.248635
H  -4.959592 1.261744 -0.396381
