program: Gaussian 09
title: 000188294
version: EM64L-G09RevD.01
frameworkgroup: C1[X(C17H21N3)]
method: RPBEPBE
basis: SDD
operation: Freq
keyword: #pfreq=noraman
keyword: PBEPBE/SDD
title: #p freq=noraman PBEPBE/SDD
converged: NO YES NO NO
title: Mulliken charges:
elementType: N N N C C C C C C C C C C C C C C C C C H H H H H H H H H H H H H H H H H H H H H
charge: -0.151775 -0.109701 -0.141448 -0.399439 -0.399452 0.458766 -0.348998 -0.331554 -0.659530 -0.659197 -0.376171 -0.322523 0.144575 0.190263 0.470296 -0.490137 -0.438662 -0.324878 -0.188135 -0.803731 0.223345 0.228891 0.223192 0.228924 0.229626 0.227252 0.241746 0.217787 0.217168 0.241564 0.217852 0.217171 0.244702 0.271082 0.247442 0.228703 0.272412 0.220606 0.230522 0.230354 0.221091
chargesum: 0.00000
title: Mulliken charges with hydrogens summed into heavy atoms:
elementType: N N N C C C C C C C C C C C C C C C C C
charge: -0.151775 -0.109701 -0.141448 0.052797 0.052664 0.458766 -0.119372 -0.104302 0.017172 0.017390 -0.131469 -0.051440 0.144575 0.190263 0.470296 -0.242695 -0.209958 -0.052466 0.032471 -0.121765
polarizability: 5.49648062e+02 -2.58274331e+00 2.02210774e+02 -1.80415235e-01 1.18715166e+01 1.08821274e+02
1716.lowfreq: -33.5036 -10.9866 -6.5138 -2.6084 -0.0008 -0.0006 -0.0002 17.6683 29.5118
frequency: -33.4738 17.5565 29.5063 45.6894 56.9778 73.6773 93.5443 102.6832 118.4497 168.7267 185.4163 207.4925 209.8206 215.1498 221.7682 275.1962 290.9250 309.4019 348.8728 370.4754 403.1045 421.1482 433.1951 443.5331 502.7335 506.4023 514.1298 529.5532 546.5437 581.7718 619.3155 632.1107 693.6170 698.6456 741.9826 758.8138 785.5946 791.5183 804.1235 806.2875 829.6753 878.8721 890.9044 900.5043 922.1345 925.2663 931.8741 961.5547 980.6426 983.2025 986.9612 991.6384 999.2595 1013.9163 1049.3050 1073.0076 1076.4712 1083.5958 1094.2902 1119.5587 1134.4579 1160.0879 1163.9446 1172.2373 1200.5736 1227.5846 1260.3539 1267.2411 1286.8945 1293.0922 1305.8854 1334.8833 1340.4496 1349.8362 1371.3462 1386.2359 1387.1810 1389.6801 1397.7717 1399.6768 1424.4186 1456.0721 1466.7720 1468.7373 1469.4746 1470.2486 1477.4228 1478.3146 1482.5064 1493.2214 1500.7659 1518.2406 1550.0397 1582.4376 1612.3073 1623.3427 2978.8432 2985.7754 2985.9406 2991.6568 2997.4907 3041.3080 3046.7639 3057.9650 3082.3076 3082.5209 3085.6773 3094.1906 3095.3958 3119.8488 3136.3651 3142.4770 3145.1910 3147.3569 3167.3420 3169.6595 3173.1013
redmass: 1.0238 3.5222 4.5985 4.4095 3.0670 4.3544 2.9786 3.3322 4.2354 2.7142 3.5402 2.5916 1.1185 3.3818 1.5601 5.7708 2.7745 2.9686 3.4906 4.0013 3.1169 3.4978 3.0562 3.3060 3.3381 3.3078 4.0213 4.0962 3.1433 3.3928 5.0549 6.8530 4.9041 2.0604 3.7949 4.7466 1.1337 1.2587 1.4346 1.2860 1.7370 5.9370 2.2887 1.3159 2.6270 2.5689 1.4522 1.3532 1.3369 4.4936 2.8157 1.3375 1.6648 2.9806 1.5615 2.1743 1.8213 1.4749 1.6746 1.4619 1.8509 1.6686 1.4008 1.2468 2.4246 2.5550 2.7208 1.4457 1.2056 1.3941 1.4771 3.8772 1.3578 1.4682 4.1694 4.6738 1.2123 1.2595 1.3521 1.9639 2.8953 3.6362 1.0624 1.0959 2.3769 1.0474 1.0845 1.1309 1.0489 1.0977 1.6017 1.7019 6.3604 5.6477 6.6659 6.3697 1.0370 1.0357 1.0357 1.0604 1.0609 1.1028 1.1024 1.0977 1.0998 1.0995 1.0988 1.1012 1.1010 1.0866 1.0914 1.0939 1.0878 1.0864 1.0953 1.0956 1.0952
irintensity: 0.4253 0.0052 1.7472 1.2555 0.0489 0.2862 1.2755 0.2540 1.3917 0.4995 0.1967 0.2930 0.7502 2.2078 0.7375 0.0216 1.3802 0.0217 3.4441 1.7025 4.1323 4.3994 3.9508 4.0204 26.7698 14.4529 1.4806 15.1435 2.1600 2.1999 4.3611 1.1780 0.7004 29.5250 7.7085 0.8819 4.9237 21.3274 18.6241 9.2766 82.0227 7.2336 0.0047 3.6718 2.5514 9.4196 8.9821 2.7088 2.1991 0.7546 0.2768 1.1431 0.2618 55.9090 13.7320 14.5929 54.1659 10.3954 19.2496 4.6827 47.6118 132.6687 59.3553 41.4015 42.0502 0.2954 0.5306 160.5047 2.4235 7.8922 41.9267 392.6916 49.3450 49.1075 2.9455 6.2907 1.5722 37.5346 16.1107 132.1187 1.6746 2.9077 7.8630 8.4539 14.1122 12.9188 0.3396 19.1349 0.0812 31.5866 78.2471 77.6361 57.0469 7.9496 40.6955 610.1439 52.1909 32.7473 32.2727 50.4825 89.7490 6.2897 10.0285 22.0045 22.6188 71.0320 23.4578 2.5065 92.9312 7.1260 16.1638 37.4766 7.2271 6.7669 22.0350 16.5921 28.7036
temp: 298.150 k
press: 1.00000 atm
elementType: 7 7 7 6 6 6 6 6 6 6 6 6 6 6 6 6 6 6 6 6 1 1 1 1 1 1 1 1 1 1 1 1 1 1 1 1 1 1 1 1 1
symmnumber: 1
zpe: 896475.5 jmol-1
zpe.correction: 0.341449 hartree
zpe.thermalcorrener: 0.360574 hartree
zpe.thermalcorrenthalpy: 0.361518 hartree
zpe.thermalcorrgfe: 0.292170 hartree
zpe.sumelectzpe: -823.163333 hartree
zpe.sumelectthermal: -823.144209 hartree
zpe.sumelectthermalent: -823.143265 hartree
zpe.sumelectthermalfe: -823.212612 hartree
dipole: -5.2349 0.9000 0.1466
dipole: 5.3138
quadrupole: -79.6427 -108.8066 -125.3796
quadrupole: 0.7932 0.2145 3.1169
quadrupole: 24.9669 -4.1970 -20.7700 0.7932 0.2145 3.1169
hfenergy: -823.5047824 hartree
pointgroup: C01 [X(C17H21N3)]
dipole: 2.055248 -0.0201562 -0.3822592 debye
polarizability: 549.3579231|-8.9559917|108.496286|-6.8463322|-9.5249439|202.825901 unknown
InChI: InChI=1S/C17H21N3/c1-4-20(5-2)17-11-9-15(10-12-17)18-19-16-8-6-7-14(3)13-16/h6-13H,4-5H2,1-3H3
charge 0 multiplicity 1
41 atoms
N  4.571628 0.049269 -0.160962
N  -1.018043 0.103064 0.895856
N  -1.853729 0.164274 -0.119837
C  5.546718 0.087246 0.949394
C  5.131353 -0.008161 -1.527709
C  3.194935 0.062025 0.072677
C  2.660216 0.005802 1.403572
C  2.253149 0.132958 -1.014328
C  5.879886 -1.309354 1.525722
C  5.290852 1.381228 -2.189078
C  1.277063 0.025347 1.623788
C  0.875127 0.144594 -0.784296
C  0.354629 0.092751 0.543854
C  -3.235146 0.174682 0.26102
C  -5.553477 0.259411 -0.589939
C  -4.155681 0.241697 -0.816063
C  -6.017064 0.208062 0.748827
C  -3.716456 0.123633 1.601598
C  -5.102525 0.140682 1.831646
C  -6.525384 0.333595 -1.756018
H  6.472859 0.55831 0.569142
H  5.16946 0.751745 1.748193
H  6.120397 -0.500235 -1.465303
H  4.502394 -0.663404 -2.157439
H  3.326761 -0.06976 2.26635
H  2.610704 0.19463 -2.046043
H  4.975632 -1.801918 1.922532
H  6.307197 -1.964587 0.745489
H  6.618182 -1.223428 2.344256
H  4.317398 1.892577 -2.282443
H  5.955907 2.027484 -1.588547
H  5.729775 1.280159 -3.198851
H  0.87357 -0.020596 2.641093
H  0.166781 0.202638 -1.616769
H  -3.749361 0.279603 -1.83376
H  -7.095604 0.221574 0.947273
H  -2.992134 0.072661 2.419849
H  -5.485164 0.102124 2.858263
H  -6.368061 1.252521 -2.351254
H  -6.39561 -0.524021 -2.442337
H  -7.572835 0.332119 -1.408913
