program: Gaussian 09
title: 000188284
version: EM64L-G09RevD.01
frameworkgroup: C1[X(C6H10O3S)]
method: RPBEPBE
basis: SDD
operation: Freq
keyword: #p
keyword: freq=noraman
keyword: PBEPBE/SDD
title: #p freq=noraman PBEPBE/SDD
converged: YES YES NO NO
title: Mulliken charges:
elementType: S O O O C C C C C C H H H H H H H H H H
charge: 0.223614 -0.442674 -0.441815 -0.433941 -0.105524 -0.477813 -0.149497 -0.307252 -0.131226 -0.522264 0.270613 0.276518 0.258098 0.229587 0.195705 0.240504 0.252975 0.358852 0.346650 0.358891
chargesum: 0.00000
title: Mulliken charges with hydrogens summed into heavy atoms:
elementType: S O O O C C C C C C
charge: 0.223614 -0.083822 -0.095165 -0.075050 0.165089 -0.201295 0.108601 0.118040 0.109278 -0.269289
polarizability: 1.02267502e+02 2.87301751e+00 9.23389577e+01 -6.17869759e+00 3.71394097e+00 7.03657403e+01
1716.lowfreq: -11.4714 -0.0016 -0.0015 0.0015 11.5836 19.4839 52.7658 100.5696 120.7972
frequency: 52.7137 100.5642 120.7920 183.3143 214.5096 243.0309 254.9643 268.3863 302.1223 339.0663 409.6821 447.7628 514.4420 531.5663 548.2061 634.0929 670.6414 712.1297 742.9578 780.7644 846.4610 895.8929 908.3800 934.0135 957.9207 969.6036 1041.0068 1074.1436 1099.5291 1169.8941 1181.5417 1196.5358 1211.0464 1228.5005 1277.8939 1302.3696 1327.0461 1331.2272 1348.6453 1356.7491 1375.5231 1411.9066 1466.0731 1600.3296 2922.6645 3021.4242 3041.6869 3059.0857 3061.2526 3124.2793 3163.7871 3408.7930 3505.1904 3553.4484
redmass: 4.9838 7.1756 5.6303 4.0879 2.7979 2.5313 1.8460 2.6868 1.8860 1.9098 5.7620 4.7685 5.2803 4.5195 3.8426 1.1775 4.6381 1.6818 4.2753 3.0677 3.7437 3.0168 3.4503 1.2375 3.4991 2.4071 2.1717 3.2749 1.5622 1.2530 1.0517 1.1807 1.2627 1.2693 1.3205 1.7549 1.1494 1.3252 1.3319 1.1797 1.6358 1.1830 1.0813 6.9226 1.0705 1.0841 1.0853 1.0879 1.0906 1.0867 1.0963 1.0662 1.0649 1.0667
irintensity: 7.3974 10.1962 1.5641 14.8284 63.2403 6.8647 12.6202 6.9992 59.5433 110.1939 16.0991 7.0642 4.0760 1.5060 4.8858 140.5970 23.5752 39.6095 10.7459 7.7230 29.0865 145.6804 11.0593 0.4480 26.8071 39.3968 61.5252 19.8326 32.0323 3.5165 5.2516 47.8979 8.4432 26.5052 32.0902 5.9380 18.4135 6.0928 25.4410 22.5021 16.2614 69.4174 6.6750 40.9386 62.5616 12.4200 19.3903 14.6397 25.2728 3.0545 9.1990 71.1742 7.3239 8.8618
temp: 298.150 k
press: 1.00000 atm
elementType: 16 8 8 8 6 6 6 6 6 6 1 1 1 1 1 1 1 1 1 1
symmnumber: 1
zpe: 409395.3 jmol-1
zpe.correction: 0.155930 hartree
zpe.thermalcorrener: 0.166663 hartree
zpe.thermalcorrenthalpy: 0.167607 hartree
zpe.thermalcorrgfe: 0.119712 hartree
zpe.sumelectzpe: -857.527198 hartree
zpe.sumelectthermal: -857.516466 hartree
zpe.sumelectthermalent: -857.515522 hartree
zpe.sumelectthermalfe: -857.563416 hartree
dipole: -2.9903 1.3984 -1.0118
dipole: 3.4527
quadrupole: -76.5583 -70.0533 -64.1438
quadrupole: -6.6770 -4.0897 1.8174
quadrupole: -6.3065 0.1985 6.1080 -6.6770 -4.0897 1.8174
hfenergy: -857.6831284 hartree
pointgroup: C01 [X(C6H10O3S1)]
dipole: 1.1187255 0.4985622 0.5874731 debye
dipolederiv: -0.4439697 -0.0264682 0.0982663 -0.2093856 -0.1336378 0.005618 0.0590053 0.0156228 -0.0748615 -0.6593558 0.0686534 0.0103615 0.0835419 -0.2004351 0.067302 -0.0650648 0.0213888 -0.756343 -0.6463756 0.020096 -0.1564119 0.200651 -0.4752931 0.2054697 -0.1891795 0.2862788 -0.5079176 -0.5924465 -0.132791 -0.1278183 -0.1818742 -0.4752739 0.0480038 -0.2087798 0.0358961 -0.6513469 0.1918089 -0.0847112 0.0394616 -0.1345165 0.059327 -0.1033281 0.142524 0.0703833 0.5138694 -0.1197976 0.1427471 -0.0101103 0.2376446 0.4105184 -0.0730145 0.0012822 -0.0899448 -0.0470945 0.2883732 -0.0131617 0.1490209 -0.2347594 0.399313 -0.0435391 0.1616713 -0.0952491 0.493154 0.3929433 0.0614394 0.1031947 -0.0205056 0.2566782 -0.0651199 0.1581656 -0.0624256 0.5591477 -0.3124191 0.0673384 -0.0434926 0.2623294 -0.1432113 0.0453942 -0.0296289 0.0257393 -0.3145237 0.8061143 -0.0694847 -0.1658692 -0.0277648 -0.027577 0.0594465 -0.2071909 0.0563651 -0.2004001 0.0899014 -0.0405448 -0.0081354 -0.0407335 -0.0827311 0.0172705 -0.0216357 -0.0422129 0.0281912 0.0211808 0.0132329 -0.0984886 -0.0531222 -0.015622 0.0418563 -0.0550872 0.0341941 -0.0722057 0.0077533 0.0372937 0.0684058 0.0655295 0.0057421 -0.0527893 0.0399813 -0.0265544 -0.0555201 0.0175974 0.0339814 0.0700514 0.0889361 0.0583069 -0.0978388 0.0575031 -0.0331156 -0.0666574 -0.0094405 0.0014332 -0.0502905 -0.0259554 -0.1981018 0.1170063 -0.0525703 0.0404076 0.0057389 -0.0819995 -0.0734168 0.0393155 -0.0146895 0.0585041 -0.026197 0.0638732 -0.0273244 0.1601708 0.0136841 -0.074345 0.0265251 -0.061384 -0.0228056 -0.0173746 0.0516065 -0.027397 0.1775042 0.2590575 -0.0440652 -0.042428 -0.0233766 0.0674798 0.0183034 -0.0015959 -0.0343622 0.375516 0.3489275 0.0112502 0.0487308 -0.0437589 0.1649816 -0.1472794 0.0528468 -0.1537262 0.1717777 0.4284625 0.101523 0.0497113 0.1331937 0.2938376 0.0008099 0.0422739 0.0060362 0.2618007 unknown
polarizability: 103.1906644|-1.3221936|92.8234681|-4.0684389|0.5408062|68.9580673 unknown
InChI: InChI=1S/C6H10O3S/c7-3-5-6(9)4(8)1-2-10-5/h1-2,4-9H,3H2
charge 0 multiplicity 1
20 atoms
S  -0.770825 1.561706 0.493056
O  -0.478949 -0.653869 -1.798696
O  1.995298 -1.5591 0.877342
O  -3.042325 -0.462705 -0.630027
C  -0.018031 -1.016032 -0.43896
C  -0.877931 -0.343048 0.652697
C  1.500673 -0.757532 -0.276197
C  -2.356698 -0.779648 0.61511
C  1.872008 0.700286 -0.140759
C  1.009194 1.70947 0.174432
H  -0.172648 -2.10779 -0.384492
H  -0.452861 -0.59652 1.642477
H  2.000973 -1.198228 -1.156642
H  -2.930551 -0.276505 1.412525
H  -2.373056 -1.87556 0.818237
H  2.926879 0.952489 -0.307479
H  1.350068 2.747946 0.239724
H  -0.363442 0.327556 -1.915973
H  2.090598 -0.955676 1.658268
H  -2.417271 -0.671236 -1.38134
