program: Gaussian 09
title: 000188278
version: EM64L-G09RevD.01
frameworkgroup: C1[X(C8H12N4O4)]
method: RPBEPBE
basis: SDD
operation: Freq
keyword: #p
keyword: freq=noraman
keyword: PBEPBE/SDD
title: #p freq=noraman PBEPBE/SDD
converged: YES YES NO NO
title: Mulliken charges:
elementType: O O O O N N N N C C C C C C C C H H H H H H H H H H H H
charge: -0.282417 -0.286090 -0.400380 -0.237854 -0.555541 -0.374908 0.073675 0.027925 -0.268864 -0.397812 -0.515006 0.197075 0.257341 -0.441250 -0.352778 0.205554 0.262357 0.244228 0.235334 0.259598 0.215055 0.285960 0.271561 0.370787 0.287369 0.257020 0.279533 0.382528
chargesum: 0.00000
title: Mulliken charges with hydrogens summed into heavy atoms:
elementType: O O O O N N N N C C C C C C C C
charge: -0.282417 -0.286090 -0.017852 -0.237854 0.001980 -0.004121 0.073675 0.027925 -0.006506 0.081750 -0.040353 0.197075 0.257341 0.103139 -0.073245 0.205554
polarizability: 1.56679183e+02 1.28596759e+01 1.44297976e+02 -1.15317308e+01 -1.17673314e+01 1.05073985e+02
1716.lowfreq: -2.8057 -0.0012 -0.0008 -0.0006 3.5983 12.1242 23.6439 27.9995 36.4110
frequency: 23.5363 27.8149 36.2372 49.1338 76.5938 83.7939 95.9808 111.5064 143.0070 171.3009 206.9442 215.8837 254.2645 274.1061 311.3744 330.8625 342.2681 361.7196 434.0549 464.2513 483.9683 529.2636 541.1125 576.8932 592.3807 603.4877 645.8656 661.6691 706.5954 731.8790 765.3060 792.9736 813.3805 827.8262 869.4179 883.4184 951.9060 995.7463 1027.3597 1037.1358 1071.3996 1089.7928 1110.5166 1129.4717 1153.7330 1163.0870 1202.3005 1226.9700 1252.9578 1261.9492 1289.4366 1312.7857 1315.8352 1336.6658 1336.9295 1378.1706 1390.0755 1435.0522 1458.9093 1460.9424 1531.7369 1547.9897 1619.2844 1656.4033 1658.0229 2058.1156 2991.1792 2994.6486 3008.3252 3033.6055 3056.5259 3061.9780 3075.1813 3202.4874 3336.7904 3410.7889 3513.6944 3532.4403
redmass: 6.6237 9.9645 8.0644 6.4397 7.4122 6.7168 5.5103 5.1425 4.7597 5.9840 2.2456 1.9760 1.9380 5.3551 4.5706 3.9396 3.8938 3.0431 7.2943 2.9435 2.4417 5.7983 4.4965 1.7779 2.6765 2.3159 3.0057 1.6824 4.3018 3.4514 1.7002 3.5812 2.2512 1.4509 2.3801 3.7044 2.2474 2.3868 2.5643 2.9948 3.2802 2.3186 2.2751 2.1606 1.5709 1.7162 1.4393 1.8074 1.2446 1.5383 1.3516 2.0246 1.6114 1.3965 1.3236 2.1716 1.5313 1.0823 1.0863 1.1055 2.6882 3.1428 4.0798 1.1571 5.9947 13.1162 1.0607 1.0606 1.0597 1.0855 1.0990 1.1021 1.1027 1.0905 1.0837 1.0461 1.0639 1.0941
irintensity: 1.1297 0.0937 1.5428 1.5190 6.1708 2.7291 5.7967 0.8645 0.5830 16.2523 12.3750 20.2596 15.6316 5.0911 18.6207 25.6483 13.6442 1.2805 0.6973 12.8297 17.9602 39.7765 15.6188 39.5663 67.1877 17.0622 15.1313 117.0832 14.3721 10.3227 234.8320 5.9669 69.4968 181.0465 19.1424 12.4066 5.3702 34.2094 46.6626 20.8791 86.6840 109.3742 11.0095 20.3715 5.1537 9.5044 20.5845 22.5670 83.1654 12.2613 20.7470 25.6484 17.1160 48.0083 3.0249 237.5078 61.0526 22.5439 17.1236 15.2971 297.1641 156.2595 137.6671 43.9638 283.8006 414.9571 49.5733 12.5303 23.8513 10.5164 5.1485 17.4523 24.8445 4.9646 456.3987 1.2791 26.2363 5.3703
temp: 298.150 k
press: 1.00000 atm
elementType: 8 8 8 8 7 7 7 7 6 6 6 6 6 6 6 6 1 1 1 1 1 1 1 1 1 1 1 1
symmnumber: 1
zpe: 554579.2 jmol-1
zpe.correction: 0.211228 hartree
zpe.thermalcorrener: 0.228344 hartree
zpe.thermalcorrenthalpy: 0.229288 hartree
zpe.thermalcorrgfe: 0.163477 hartree
zpe.sumelectzpe: -830.701143 hartree
zpe.sumelectthermal: -830.684027 hartree
zpe.sumelectthermalent: -830.683083 hartree
zpe.sumelectthermalfe: -830.748894 hartree
dipole: -5.1012 0.1180 -0.4104
dipole: 5.1190
quadrupole: -90.6985 -107.0706 -87.3188
quadrupole: -2.5732 15.2931 -2.6993
quadrupole: 4.3308 -12.0413 7.7105 -2.5732 15.2931 -2.6993
hfenergy: -830.912371 hartree
pointgroup: C01 [X(C8H12N4O4)]
dipole: -2.0096034 0.0596226 0.1185896 debye
polarizability: 155.1299239|-11.2178467|140.8815699|13.7093925|-17.822025|110.0396494 unknown
InChI: InChI=1S/C8H12N4O4/c9-6(2-1-5(13)3-12-10)8(16)11-4-7(14)15/h3,6,11,14H,1-2,4,9H2
charge 0 multiplicity 1
28 atoms
O  2.146823 -2.10211 0.724981
O  -1.146336 1.176536 -0.367667
O  3.36051 0.931805 -1.54352
O  4.496398 2.173465 0.057575
N  0.211496 -3.125693 -1.088342
N  1.471772 0.07964 0.244017
N  -3.892321 1.602394 -0.70356
N  -4.176811 2.430965 -1.486878
C  0.008133 -1.801585 -0.468977
C  -1.159653 -1.917282 0.552008
C  -1.567591 -0.598645 1.277195
C  1.305683 -1.289949 0.220392
C  -1.997658 0.495331 0.302057
C  2.678506 0.685913 0.787193
C  -3.441746 0.692456 0.157176
C  3.600171 1.35157 -0.233034
H  -0.280153 -1.087947 -1.261609
H  -2.02025 -2.339301 0.001576
H  -0.876061 -2.656119 1.326748
H  -0.709072 -0.213847 1.857421
H  -2.383576 -0.82291 1.987695
H  0.736917 -3.740511 -0.449349
H  0.702381 -3.064196 -1.988943
H  0.711252 0.670707 -0.132308
H  3.254931 -0.12293 1.279745
H  2.452031 1.44768 1.555052
H  -4.18366 0.124541 0.718489
H  4.013984 1.378124 -2.148432
