program: Gaussian 09
title: 000188249
version: EM64L-G09RevD.01
frameworkgroup: C1[X(C17H17ClN4O)]
method: RPBEPBE
basis: SDD
operation: Freq
keyword: #p
keyword: freq=noraman
keyword: PBEPBE/SDD
title: #p freq=noraman PBEPBE/SDD
converged: YES YES NO NO
title: Mulliken charges:
elementType: Cl O N N N N C C C C C C C C C C C C C C C C C H H H H H H H H H H H H H H H H H
charge: -0.070160 -0.268200 -0.159650 -0.061525 -0.116390 0.049664 -0.372507 -0.392466 -0.375780 -0.364749 0.137189 -0.613744 0.139578 -0.091324 0.174788 -0.282065 0.205170 -0.340026 -0.182573 -0.330551 -0.338685 -0.084433 -0.231953 0.258427 0.226493 0.243977 0.238489 0.219873 0.187400 0.176722 0.219039 0.225247 0.189738 0.227865 0.271110 0.274636 0.236949 0.265345 0.251114 0.257970
chargesum: 0.00000
title: Mulliken charges with hydrogens summed into heavy atoms:
elementType: Cl O N N N N C C C C C C C C C C C C C C C C C
charge: -0.070160 -0.268200 -0.159650 -0.061525 -0.116390 0.049664 0.112413 0.090001 0.031493 0.031013 0.137189 0.029106 0.139578 -0.091324 0.174788 -0.010955 0.205170 -0.065390 0.054376 -0.065206 -0.087571 -0.084433 0.026016
polarizability: 3.39966925e+02 -1.56841002e+01 2.48217783e+02 -1.11251337e+01 -1.69292374e+00 1.36685943e+02
1716.lowfreq: -6.2113 -3.1679 -0.0013 -0.0012 0.0010 2.0095 29.6902 36.4970 52.1023
frequency: 29.6590 36.4955 52.0908 66.4389 77.8628 104.6803 129.2085 157.1262 175.6917 193.0051 225.9911 236.2566 251.5541 266.0867 302.4289 304.3897 321.5808 326.6047 363.7262 376.1841 385.6867 397.1569 428.5324 447.5369 463.6792 474.4445 509.1167 521.2829 562.6142 579.0650 585.6212 601.4122 633.3480 658.5712 670.4874 692.7591 706.1879 744.1086 756.2159 781.5602 808.3050 813.3304 831.0594 839.1760 857.2061 870.9443 901.8610 934.9056 939.8260 944.3002 984.8974 1002.7178 1014.7865 1047.8687 1051.6071 1061.9582 1067.3424 1071.9643 1079.2401 1094.6526 1124.3017 1140.9818 1147.7764 1152.3770 1160.9586 1185.8531 1192.6750 1214.4597 1237.1232 1242.1921 1247.2136 1275.4807 1282.7347 1290.9839 1317.0654 1329.7943 1350.5532 1354.0082 1358.3073 1371.6063 1378.2664 1397.8811 1418.7981 1431.2447 1435.9997 1454.7387 1455.1500 1460.9784 1463.5073 1469.6936 1474.7949 1481.6296 1534.1712 1549.7962 1573.5134 1577.2933 1599.2911 2824.4612 2846.9969 2867.5391 2960.6867 2975.3193 3022.9191 3032.4640 3036.5858 3080.5478 3098.5054 3101.3408 3139.0094 3145.4776 3165.1563 3174.5235 3179.3518 3185.1021
redmass: 4.0362 5.8492 3.9778 5.1806 5.1064 7.1781 4.4591 3.5906 3.7942 6.3202 1.5707 2.4495 2.9668 5.8075 6.4999 3.1643 2.3257 4.6553 3.1789 6.5581 4.8540 2.2751 5.6362 3.9940 4.2245 2.7526 4.8197 4.7426 5.7319 4.2945 5.3372 4.0643 4.9486 5.0892 5.7335 6.5957 4.2237 3.6782 4.7763 3.5377 1.7156 1.3713 5.4436 1.6581 4.7964 1.4632 4.3344 1.3363 1.9908 1.5676 1.3830 2.5142 2.8631 1.6674 2.3588 1.9747 1.7047 2.4200 1.9032 2.2160 1.5456 1.6975 2.5983 2.3164 2.7001 2.6069 1.0710 2.7213 1.5169 2.1359 1.6513 2.1044 1.7582 1.4927 10.1706 1.2801 1.4473 4.6140 1.4337 1.5851 2.8546 2.6475 2.4633 1.1749 3.1503 1.3609 1.7033 1.0769 1.2036 1.1175 1.1028 1.0533 5.6876 7.2498 6.9018 9.3264 8.1850 1.0708 1.0684 1.0579 1.0698 1.0686 1.0737 1.0874 1.0898 1.1011 1.0915 1.0932 1.0877 1.0927 1.0887 1.0997 1.0928 1.0976
irintensity: 0.2678 0.1879 0.0389 0.1698 4.2939 1.1613 1.6484 9.9749 2.2281 0.9720 0.3470 1.0858 2.8816 0.2567 7.6674 6.4151 3.3385 5.4217 1.4040 1.5057 1.0382 8.3269 5.0920 9.3917 2.7344 1.6587 3.8350 1.7262 3.2934 5.7632 2.4908 2.8324 4.6991 17.1361 32.6535 2.4294 2.6082 6.7135 2.2551 12.7914 21.6246 61.9475 33.3356 2.2048 84.7773 24.2926 6.6292 1.8536 0.6931 1.3185 5.7449 97.9800 5.7560 7.4326 1.0414 14.2984 30.4736 36.2735 14.2780 52.7514 25.5875 2.8919 37.2770 37.5567 113.8378 32.7390 0.7111 28.6314 4.9346 3.9994 85.5750 43.6181 52.1125 57.5119 1.4759 0.7577 0.5037 17.1076 45.7227 1.1241 63.5116 84.5315 40.4091 1.3596 196.4399 15.3548 22.4937 29.2143 0.7650 42.4193 13.1225 8.8629 71.6042 52.0912 34.2590 658.4724 8.5928 73.8521 57.5788 197.8998 48.7232 46.2727 47.4241 43.0869 57.2117 29.2946 17.1279 6.4061 2.3815 13.3511 0.4749 22.1287 0.4998 1.1622
temp: 298.150 k
press: 1.00000 atm
elementType: 17 8 7 7 7 7 6 6 6 6 6 6 6 6 6 6 6 6 6 6 6 6 6 1 1 1 1 1 1 1 1 1 1 1 1 1 1 1 1 1
symmnumber: 1
zpe: 818147.5 jmol-1
zpe.correction: 0.311616 hartree
zpe.thermalcorrener: 0.331057 hartree
zpe.thermalcorrenthalpy: 0.332001 hartree
zpe.thermalcorrgfe: 0.263112 hartree
zpe.sumelectzpe: -1410.609273 hartree
zpe.sumelectthermal: -1410.589832 hartree
zpe.sumelectthermalent: -1410.588888 hartree
zpe.sumelectthermalfe: -1410.657777 hartree
dipole: -6.5921 1.1395 2.5088
dipole: 7.1448
quadrupole: -132.0917 -137.9761 -144.3486
quadrupole: 3.6471 -6.3827 5.8631
quadrupole: 6.0471 0.1627 -6.2098 3.6471 -6.3827 5.8631
hfenergy: -1410.9208893 hartree
pointgroup: C01 [X(C17H17Cl1N4O1)]
dipole: -2.5753203 0.7278114 0.8600782 debye
polarizability: 337.2619654|-23.2985538|250.5064814|-3.679859|-10.2226047|137.1022049 unknown
InChI: InChI=1S/C17H17ClN4O/c1-21-7-9-22(10-8-21)16-13-3-2-6-19-17(13)23-15-5-4-12(18)11-14(15)20-16/h2-6,11H,7-10H2,1H3
charge 0 multiplicity 1
40 atoms
Cl 5.02496 -3.031164 1.271288
O  1.657549 1.254189 -1.338313
N  -1.881097 -0.579483 -0.214691
N  -4.629944 -1.435514 -0.187733
N  0.390007 -1.107557 -0.104916
N  1.075938 3.270665 -0.288216
C  -2.209635 -2.023181 -0.218487
C  -2.937606 0.242634 -0.852032
C  -3.571563 -2.243436 0.463803
C  -4.289904 0.003565 -0.157768
C  -0.548434 -0.173092 -0.112936
C  -5.973801 -1.714341 0.352891
C  -0.303584 1.284908 0.137042
C  0.794311 1.964498 -0.463576
C  1.770836 -0.869506 -0.049984
C  -1.098261 2.040646 1.03753
C  2.426428 0.243805 -0.664767
C  2.600904 -1.868489 0.536934
C  -0.813648 3.406742 1.249273
C  3.825152 0.358795 -0.705936
C  0.267103 3.986399 0.547201
C  3.996076 -1.730614 0.501659
C  4.636748 -0.637473 -0.117284
H  -1.403449 -2.560461 0.303343
H  -2.249514 -2.398132 -1.261901
H  -3.029418 -0.054926 -1.918102
H  -2.669537 1.308932 -0.816619
H  -3.843327 -3.312206 0.383304
H  -3.476177 -1.995198 1.552854
H  -4.23836 0.398648 0.892195
H  -5.076564 0.567076 -0.693081
H  -6.72931 -1.140867 -0.213443
H  -6.079652 -1.452739 1.43616
H  -6.204319 -2.788252 0.236606
H  -1.924015 1.550225 1.564027
H  2.122918 -2.738318 0.993848
H  -1.411056 4.009946 1.938734
H  4.265607 1.229777 -1.199285
H  0.513159 5.048193 0.656176
H  5.726778 -0.564194 -0.143298
