program: Gaussian 09
title: 000188243
version: EM64L-G09RevD.01
frameworkgroup: C1[X(C12H14F3N2O8P)]
method: RPBEPBE
basis: SDD
operation: Freq
keyword: #p
keyword: freq=noraman
keyword: PBEPBE/SDD
title: #p freq=noraman PBEPBE/SDD
converged: YES YES NO NO
title: Mulliken charges:
elementType: P F F F O O O O O O O O N N C C C C C C C C C C C C H H H H H H H H H H H H H H
charge: 1.399310 -0.152666 -0.219674 -0.144143 -0.289732 -0.428992 -0.501581 -0.250098 -0.717458 -0.715492 -0.233565 -0.560364 -0.200491 -0.404027 -0.134891 -0.017724 -0.504542 -0.023132 -0.307025 -0.217257 0.190667 0.196929 0.099411 -0.213861 -0.349636 0.331247 0.217116 0.274164 0.286441 0.254781 0.290237 0.241123 0.260395 0.357237 0.347266 0.369354 0.286110 0.342311 0.409223 0.433029
chargesum: 0.00000
title: Mulliken charges with hydrogens summed into heavy atoms:
elementType: P F F F O O O O O O O O N N C C C C C C C C C C C C
charge: 1.399310 -0.152666 -0.219674 -0.144143 -0.289732 -0.071755 -0.501581 -0.250098 -0.308235 -0.282463 -0.233565 -0.560364 -0.200491 -0.034673 0.082226 0.256441 0.036679 0.267106 0.194493 0.130008 0.190667 0.196929 0.099411 0.072249 -0.007325 0.331247
polarizability: 2.67104864e+02 5.28422165e+00 2.16209977e+02 -3.50953392e+00 1.26977152e+01 1.31205621e+02
1716.lowfreq: -4.1729 -3.0833 -0.0006 -0.0004 0.0004 3.0444 22.4618 35.0105 46.3053
frequency: 22.4175 35.0017 46.2852 51.4971 54.4946 66.8741 83.2285 90.6059 101.0557 105.2979 113.8161 144.8220 163.2035 175.8469 181.7278 199.0591 210.3798 217.0254 227.5072 241.5602 280.6116 286.3740 294.3416 324.4521 328.3503 342.9872 351.3321 363.9605 376.6105 386.0888 398.6233 404.3265 432.9651 437.7617 453.0018 484.8929 502.0875 509.5138 518.0335 533.7312 563.2864 569.2967 596.3060 629.8860 637.6105 677.9347 701.2300 708.4880 727.7353 739.7338 742.2237 750.7314 783.0721 787.6525 803.0427 857.3530 878.6827 896.6332 930.9409 939.5767 954.4442 990.0430 992.3673 1006.1402 1015.0223 1027.1588 1039.6060 1048.0027 1053.1220 1059.6659 1063.4333 1077.8510 1102.3237 1117.0938 1124.1182 1173.5837 1205.2533 1207.8359 1228.8700 1239.5357 1243.9124 1268.6752 1276.5325 1289.9074 1302.0250 1324.1995 1329.5340 1340.6948 1344.8625 1367.1001 1369.6110 1371.0671 1400.6000 1416.1939 1456.6400 1469.5658 1593.2435 1632.7737 1651.8451 1666.4028 2960.5518 3015.3511 3038.0910 3051.2875 3072.4735 3087.2910 3114.8229 3127.1525 3130.7942 3144.8759 3445.5654 3518.6762 3579.0950 3595.7090
redmass: 9.2566 11.4086 7.1261 8.2585 10.1133 8.8848 8.9699 6.3383 7.2907 7.4931 5.6247 6.4411 8.0540 5.9689 5.4373 4.5114 5.6735 5.1001 3.6540 8.7225 3.0108 1.3858 4.8971 4.4046 6.2343 8.1235 4.4348 2.1857 5.5994 6.3943 5.8414 10.2658 4.2519 4.0140 3.1897 8.2790 7.0900 3.2207 8.8649 5.8597 1.2694 5.0539 5.7709 8.2620 5.2335 5.1660 3.5655 8.9275 3.0067 7.4355 7.9665 6.9748 3.4174 2.3491 6.1375 4.0291 3.5056 2.2715 2.8664 2.8285 6.6710 1.3636 2.8167 2.3964 1.1939 5.5719 3.2136 1.3817 2.5779 2.5033 1.6022 2.6859 5.0137 2.3725 4.9208 1.4647 1.6639 2.1736 1.1824 1.4239 4.1543 1.4343 1.5682 1.4917 1.7063 1.2215 1.6159 1.3101 1.2653 1.5721 1.5859 1.8374 1.5595 4.3576 1.0792 1.0898 5.4990 11.5778 5.6861 5.6825 1.0849 1.0579 1.0651 1.0860 1.0888 1.1069 1.0969 1.1010 1.0884 1.0940 1.0682 1.0770 1.0667 1.0660
irintensity: 1.4820 0.3543 4.7080 1.4040 0.4619 2.2568 0.8316 1.7086 1.4203 2.2816 5.4179 3.9342 7.0280 7.5128 3.4129 6.2798 1.6223 6.6826 15.2675 2.3094 31.7505 96.9491 1.5750 5.5707 19.4150 5.1190 36.9632 68.9906 16.2309 17.1251 28.6513 9.8371 18.9271 6.2463 23.5151 28.5591 43.8710 6.3930 2.9110 11.5460 283.4223 5.4547 3.0060 85.1976 3.5334 7.8827 7.7355 155.1939 8.4008 107.0133 9.9632 63.1826 69.0024 125.5963 42.1345 91.2455 2.9094 29.2232 50.2723 160.6255 167.9799 18.8217 98.2175 45.3049 42.6974 145.2343 20.5395 129.7932 59.6037 7.9295 187.5157 8.2956 191.1361 46.4209 16.9941 123.2476 55.9928 12.2055 6.3837 38.7101 445.4109 88.0370 86.1503 81.8223 128.7734 10.8188 166.3547 3.8218 42.4553 17.8349 0.5669 5.8525 6.7899 49.1398 9.1283 24.8192 13.6470 352.9703 878.1130 50.6860 36.2794 16.1707 6.0542 11.3434 13.3727 10.4874 21.7740 3.2193 4.6358 54.6887 434.5954 73.0162 18.4973 62.9022
temp: 298.150 k
press: 1.00000 atm
elementType: 15 9 9 9 8 8 8 8 8 8 8 8 7 7 6 6 6 6 6 6 6 6 6 6 6 6 1 1 1 1 1 1 1 1 1 1 1 1 1 1
symmnumber: 1
zpe: 718870.5 jmol-1
zpe.correction: 0.273803 hartree
zpe.thermalcorrener: 0.299606 hartree
zpe.thermalcorrenthalpy: 0.300550 hartree
zpe.thermalcorrgfe: 0.217362 hartree
zpe.sumelectzpe: -1815.757898 hartree
zpe.sumelectthermal: -1815.732095 hartree
zpe.sumelectthermalent: -1815.731151 hartree
zpe.sumelectthermalfe: -1815.814339 hartree
dipole: 7.1967 0.7647 0.6106
dipole: 7.2629
quadrupole: -167.3238 -197.3432 -149.0277
quadrupole: -7.6615 8.5476 -4.5518
quadrupole: 3.9078 -26.1117 22.2039 -7.6615 8.5476 -4.5518
hfenergy: -1816.0317014 hartree
pointgroup: C01 [X(C12H14F3N2O8P1)]
dipole: -2.8136551 -0.4500831 -0.2139877 debye
polarizability: 266.455765|7.9674371|212.2260476|0.1668933|-23.3655361|135.8386491 unknown
InChI: InChI=1S/C12H14F3N2O8P/c13-12(14,15)2-1-6-4-17(11(20)16-10(6)19)9-3-7(18)8(25-9)5-24-26(21,22)23/h1-2,4,7-9,16,18,21-22H,3,5H2
charge 0 multiplicity 1
40 atoms
P  2.508246 -2.588481 0.524607
F  4.464849 2.205017 0.527503
F  4.271394 0.613622 -1.074993
F  3.801839 2.799354 -1.558114
O  -1.217218 -1.81671 1.04964
O  -3.015632 -3.859595 -1.326253
O  1.142008 -3.524839 0.095186
O  -4.219539 1.104846 0.464351
O  1.893795 -1.201014 1.393943
O  2.815195 -1.810959 -0.951976
O  -1.032078 4.00146 -1.356556
O  3.617206 -3.417451 1.277595
N  -1.985743 0.367095 0.334302
N  -2.584407 2.516904 -0.445692
C  -2.457708 -2.580349 -0.895533
C  -1.24712 -2.902356 0.011116
C  -3.382837 -1.754349 0.028513
C  -2.399747 -0.980136 0.927135
C  0.062641 -2.980792 -0.764049
C  -0.655492 0.676172 0.110789
C  -3.019541 1.324339 0.142174
C  -0.23849 1.884708 -0.430971
C  -1.252692 2.890174 -0.800933
C  1.163107 2.203064 -0.706112
C  2.233612 1.549923 -0.168951
C  3.630796 1.835517 -0.554603
H  -2.142714 -1.973684 -1.772396
H  -1.43166 -3.856391 0.536307
H  -4.090864 -1.098405 -0.496837
H  -3.954676 -2.454677 0.66337
H  -2.799895 -0.773608 1.932662
H  0.356759 -2.006888 -1.19547
H  -0.060817 -3.715977 -1.579179
H  -3.717279 -3.70947 -2.008071
H  0.049195 -0.110033 0.400481
H  -3.314677 3.214147 -0.626825
H  1.317317 3.046287 -1.392569
H  2.133868 0.747876 0.571851
H  1.671214 -1.378793 2.343248
H  3.461491 -1.050448 -0.979887
