program: Gaussian 09
title: 000188235
version: EM64L-G09RevD.01
frameworkgroup: C1[X(C20H14Br2N4O)]
method: RPBEPBE
basis: SDD
operation: Freq
keyword: #p
keyword: freq=noraman
keyword: PBEPBE/SDD
title: #p freq=noraman PBEPBE/SDD
converged: NO YES NO NO
title: Mulliken charges:
elementType: Br Br O N N N N C C C C C C C C C C C C C C C C C C C C H H H H H H H H H H H H H H
charge: -0.004978 -0.006122 -0.282740 -0.074453 -0.350880 -0.413365 -0.409647 -0.272068 0.359965 -0.444363 0.108171 -0.086200 0.249133 0.276163 -0.412393 0.137327 0.128004 0.224198 -0.408440 -0.356321 -0.311269 -0.356354 -0.215582 -0.195528 -0.313069 -0.219577 -0.192773 0.258168 0.244045 0.246146 0.288299 0.329458 0.313341 0.235161 0.315528 0.255467 0.318786 0.291803 0.245459 0.256624 0.244873
chargesum: 0.00000
title: Mulliken charges with hydrogens summed into heavy atoms:
elementType: Br Br O N N N N C C C C C C C C C C C C C C C C C C C C
charge: -0.004978 -0.006122 -0.282740 -0.074453 -0.021423 -0.100024 -0.090861 -0.013900 0.359965 0.045827 0.108171 -0.086200 0.249133 0.276163 -0.124094 0.137327 0.128004 0.224198 -0.173279 -0.040793 -0.055802 -0.064551 0.029878 -0.195528 -0.056445 0.025296 -0.192773
polarizability: 4.68961567e+02 -6.98914374e+00 3.09444300e+02 1.83404185e+01 -1.53034065e+01 1.26843800e+02
1716.lowfreq: -3.0119 -0.0041 -0.0007 -0.0004 1.1973 5.3718 15.3760 22.5573 26.8007
frequency: 15.3400 22.5544 26.7796 51.9687 59.5262 68.3389 85.2891 108.5869 128.7771 151.6429 183.0344 185.7901 200.2429 215.2087 224.0643 244.8551 266.5313 284.5927 300.8651 312.1109 321.5589 340.3384 386.3878 418.5984 422.7416 431.0579 450.3201 463.7150 514.3812 525.4582 535.2568 556.3139 573.6340 577.4169 592.4510 592.4748 609.6589 611.9380 634.9949 643.8870 654.0110 673.7136 706.9852 750.0346 756.2043 773.2193 775.3934 786.4080 805.9554 816.4853 832.2387 835.7460 855.3995 858.0044 861.8661 871.5501 876.7989 877.2190 929.1390 943.1836 980.3732 987.8779 1032.0690 1043.9518 1046.1915 1062.6293 1086.9253 1093.3473 1098.9721 1123.8973 1143.3175 1155.0688 1210.4257 1226.4749 1228.0896 1232.2336 1244.8061 1256.5762 1271.5838 1277.7894 1289.5542 1314.7269 1333.0633 1339.8982 1362.7261 1384.5264 1388.4541 1398.1358 1402.3063 1410.4556 1447.4601 1459.3366 1464.0134 1464.1062 1473.3320 1513.6656 1556.9486 1561.7850 1577.7028 1580.9164 1614.8887 1620.9459 1623.5675 2924.7900 2972.1491 3065.0576 3133.1860 3162.4697 3162.7391 3164.0254 3173.9045 3188.3758 3244.9210 3252.6097 3532.4363 3606.9673 3613.7473
redmass: 9.7911 9.5388 5.5846 7.0453 5.8799 9.9094 6.2919 7.6038 9.0243 7.9043 8.7058 9.5652 5.0738 4.4170 4.5779 3.7270 5.7462 5.7815 8.7827 9.4330 6.6695 7.1820 6.2368 4.2431 2.9039 3.3237 4.0988 4.1742 4.2108 1.7373 2.2367 6.4373 1.3427 5.9963 4.4376 4.2986 2.2485 2.6579 3.3316 3.4736 3.0318 6.7673 6.8922 3.4584 4.5485 5.6092 5.1157 5.2320 1.9377 2.1709 1.6502 1.5423 1.4871 1.4727 1.6330 3.1315 4.8638 4.9508 5.5113 1.3379 1.3157 2.8018 3.2855 2.0100 2.0936 3.2166 2.3050 1.6106 1.9484 1.6016 1.3798 1.7829 1.3235 1.5395 1.8065 1.5199 2.3644 2.0896 1.9452 2.2390 1.5957 1.7146 1.9066 2.1182 1.9890 6.1553 6.6831 2.9404 2.0473 3.1212 4.6777 4.8986 3.0571 3.0593 1.1149 8.2905 8.6442 7.9672 7.3107 6.8574 6.1274 7.3174 6.9584 1.0809 1.0661 1.0981 1.0896 1.0931 1.0931 1.0897 1.0951 1.0961 1.0988 1.0995 1.0773 1.0811 1.0811
irintensity: 0.3033 0.1329 0.6367 0.2977 3.0154 1.1182 4.7633 1.0493 0.0485 0.0089 0.9262 0.4285 6.9092 3.1056 1.3912 3.1907 4.9503 2.1694 9.2206 15.4750 2.0371 3.2703 2.3216 9.3155 13.4899 13.0105 2.4200 5.0542 23.3940 49.5403 58.8610 11.2655 63.0157 29.3786 13.2491 0.7435 54.1359 50.0737 30.3338 2.3187 37.9429 14.6048 19.0582 1.9473 2.8641 16.2006 8.4575 2.6455 25.4352 85.3687 58.4188 8.6122 29.5598 22.2528 15.7783 31.6789 43.2373 13.6947 46.1224 0.1961 1.5015 35.8705 16.1561 14.2228 10.9364 10.0967 1.0975 54.8272 25.5043 103.4579 7.3986 12.4297 3.4870 24.1655 9.2008 6.9294 41.7033 10.4885 6.0489 0.2063 21.7749 61.0582 8.2872 67.6463 94.3908 14.3225 61.9835 44.5463 21.8731 17.3888 49.1170 23.7627 30.8591 43.1563 18.9549 26.2139 485.6975 55.3381 12.7512 2.7243 177.0897 33.7709 25.7808 12.8438 46.0136 29.0625 11.9005 3.4580 2.5593 0.9591 5.4590 4.8267 0.2438 16.5112 35.6946 99.8242 61.5757
temp: 298.150 k
press: 1.00000 atm
elementType: 35 35 8 7 7 7 7 6 6 6 6 6 6 6 6 6 6 6 6 6 6 6 6 6 6 6 6 1 1 1 1 1 1 1 1 1 1 1 1 1 1
symmnumber: 1
zpe: 784515.4 jmol-1
zpe.correction: 0.298806 hartree
zpe.thermalcorrener: 0.321277 hartree
zpe.thermalcorrenthalpy: 0.322221 hartree
zpe.thermalcorrgfe: 0.243445 hartree
zpe.sumelectzpe: -1089.851973 hartree
zpe.sumelectthermal: -1089.829503 hartree
zpe.sumelectthermalent: -1089.828558 hartree
zpe.sumelectthermalfe: -1089.907334 hartree
dipole: 0.7589 1.8253 2.6511
dipole: 3.3069
quadrupole: -183.0018 -166.1490 -176.3054
quadrupole: 7.4448 1.8215 -2.1370
quadrupole: -7.8497 9.0031 -1.1534 7.4448 1.8215 -2.1370
hfenergy: -1090.1507795 hartree
pointgroup: C01 [X(C20H14Br2N4O1)]
dipole: -0.3401483 0.7324833 -1.0200462 debye
polarizability: 464.8790821|20.9033749|310.3868142|26.7829596|26.0002929|129.983771 unknown
InChI: InChI=1S/C20H14Br2N4O/c21-10-1-3-12-14(7-23-16(12)5-10)18-9-25-20(27)19(26-18)15-8-24-17-6-11(22)2-4-13(15)17/h1-8,18,23-25H,9H2
charge 0 multiplicity 1
41 atoms
Br 8.0314 -1.335016 0.363113
Br -5.866581 -4.204856 -0.202187
O  -1.882393 3.955001 0.457661
N  -0.357087 0.644932 0.178193
N  0.302065 3.397088 -0.080318
N  2.810734 -1.880027 -1.147033
N  -4.974673 1.183401 -0.221169
C  1.05822 1.095675 0.306069
C  1.994297 -0.003391 -0.134243
C  1.299607 2.395758 -0.503126
C  3.420437 -0.083613 0.126224
C  -1.311051 1.562193 0.1195
C  3.906084 -1.275305 -0.523897
C  -2.703464 1.136125 0.009273
C  1.660882 -1.111472 -0.90918
C  -1.014062 3.069334 0.17713
C  -3.195911 -0.240443 -0.015973
C  -4.623653 -0.175891 -0.163093
C  4.340217 0.717182 0.853822
C  -3.832581 1.967432 -0.117801
C  5.260153 -1.674641 -0.47463
C  -2.581476 -1.514091 0.086996
C  5.694657 0.33638 0.917815
C  6.128259 -0.843794 0.253547
C  -5.446474 -1.320142 -0.22397
C  -3.382293 -2.673855 0.031637
C  -4.788507 -2.559109 -0.126094
H  1.245555 1.324277 1.38003
H  2.314557 2.787663 -0.319076
H  1.21082 2.170681 -1.585896
H  0.685089 -1.402792 -1.289124
H  0.528134 4.394932 -0.083284
H  2.835944 -2.750459 -1.6731
H  4.012512 1.622496 1.377089
H  -3.867271 3.053483 -0.113626
H  5.621441 -2.579513 -0.971029
H  -5.922238 1.544278 -0.311704
H  -1.499592 -1.577291 0.221885
H  6.415574 0.93899 1.476733
H  -6.532274 -1.25743 -0.336646
H  -2.926155 -3.664173 0.115583
