program: Gaussian 09
title: 000196420
version: EM64L-G09RevD.01
frameworkgroup: C1[X(C9H8N4O5)]
method: RPBEPBE
basis: SDD
operation: Freq
keyword: #pfreq=noraman
keyword: PBEPBE/SDD
title: #p freq=noraman PBEPBE/SDD
converged: YES YES NO NO
title: Mulliken charges:
elementType: O O O O O N N N N C C C C C C C C C H H H H H H H H
charge: -0.123451 -0.414702 -0.197215 -0.227443 -0.186854 -0.382255 -0.055496 0.009909 0.017752 -0.154305 0.453519 -0.112370 -0.028980 -0.363233 0.389479 -0.721277 -0.398593 0.187071 0.271502 0.350938 0.264512 0.236748 0.249324 0.252283 0.291826 0.391311
chargesum: 0.00000
title: Mulliken charges with hydrogens summed into heavy atoms:
elementType: O O O O O N N N N C C C C C C C C C
charge: -0.123451 -0.023392 -0.197215 -0.227443 -0.186854 -0.031317 -0.055496 0.009909 0.017752 0.117197 0.453519 -0.112370 -0.028980 -0.098720 0.389479 0.017079 -0.106767 0.187071
polarizability: 2.36577107e+02 -1.28822793e+01 1.64600871e+02 1.30471816e+01 7.89841151e+00 8.07266792e+01
1716.lowfreq: -9.2552 -8.3452 -2.5370 -0.0009 0.0002 0.0004 11.4497 29.3906 42.1865
frequency: 11.1424 29.3111 42.1843 63.6985 85.5684 106.3054 165.3134 180.8450 199.5573 221.8429 233.3168 260.0125 282.5827 291.1896 348.0987 382.6533 410.8339 457.2157 509.3261 514.2572 555.6158 571.3576 575.3228 608.5139 612.7873 629.0576 641.3994 681.7414 700.2466 709.0133 712.9043 728.1965 774.1167 780.8463 835.6334 844.6971 927.7739 935.1140 978.4245 995.2663 1030.0016 1042.5880 1081.2516 1091.1493 1154.3528 1190.5043 1227.0517 1243.5330 1268.0330 1292.4252 1306.3953 1331.8976 1351.4297 1353.3675 1388.4929 1397.4289 1453.3739 1472.4178 1479.4737 1489.0452 1515.0969 1585.9521 1603.1592 1679.0017 2998.3547 3029.8720 3099.7661 3114.7550 3162.1323 3178.1322 3512.8772 3527.3872
redmass: 9.6601 6.4782 8.1087 13.8962 6.3136 5.1747 9.1476 11.1568 4.6044 2.4285 1.5020 4.3045 5.3998 4.4496 4.9526 7.7793 7.9550 7.0254 3.9764 4.7894 1.4594 5.8045 8.0527 4.1316 1.5649 5.4188 5.2270 8.3421 5.3733 5.9796 8.1698 7.6573 6.1966 2.7219 1.4417 13.7743 4.0351 3.1017 1.3442 8.2747 2.7545 2.0653 1.8863 2.6746 2.4120 2.9707 5.2183 1.5287 1.9200 2.2144 2.4409 2.8364 2.8277 2.4231 3.3932 1.2621 3.4351 1.0693 1.2395 2.3454 3.8613 5.3151 6.7871 8.8256 1.0361 1.0850 1.1010 1.1002 1.0885 1.0950 1.0643 1.0779
irintensity: 1.3845 0.8431 0.4819 0.1113 1.1494 0.7716 0.1851 1.1130 0.4442 2.2886 0.1897 0.7125 0.0837 0.9179 5.0629 1.4027 0.1981 19.3967 18.6029 31.9660 80.5949 5.9942 9.1930 14.3856 94.0518 17.4626 43.0684 12.3596 8.4402 36.7540 6.3796 9.3670 0.9857 2.4166 41.8993 17.9335 10.8042 5.6794 2.3211 12.2332 286.9461 18.7515 23.5617 12.8045 133.2011 7.0916 568.4623 4.4846 5.3327 11.9716 9.4138 70.8177 76.3227 27.2764 12.0000 30.9971 116.6364 13.8047 15.0638 33.0694 13.1934 592.0610 106.1428 180.7422 12.2121 6.2723 14.7951 12.9761 4.5167 7.3724 37.2753 108.0886
temp: 298.150 k
press: 1.00000 atm
elementType: 8 8 8 8 8 7 7 7 7 6 6 6 6 6 6 6 6 6 1 1 1 1 1 1 1 1
symmnumber: 1
zpe: 462021.6 jmol-1
zpe.correction: 0.175975 hartree
zpe.thermalcorrener: 0.192036 hartree
zpe.thermalcorrenthalpy: 0.192980 hartree
zpe.thermalcorrgfe: 0.129569 hartree
zpe.sumelectzpe: -941.424485 hartree
zpe.sumelectthermal: -941.408425 hartree
zpe.sumelectthermalent: -941.407480 hartree
zpe.sumelectthermalfe: -941.470891 hartree
dipole: -10.8186 -1.2935 -2.4155
dipole: 11.1602
quadrupole: -116.9917 -107.5909 -104.8388
quadrupole: 5.2694 2.8691 -5.1611
quadrupole: -7.1845 2.2162 4.9683 5.2694 2.8691 -5.1611
hfenergy: -941.6004602 hartree
pointgroup: C01 [X(C9H8N4O5)]
dipole: 4.2518523 0.5233924 -0.9625428 debye
dipolederiv: 0.108646 -0.180702 -0.0133135 -0.2806119 -0.3646127 0.0538123 -0.0010499 0.0502453 -0.0919292 -0.6692538 -0.3177473 0.1107303 -0.5300895 -0.9889451 0.2039286 -0.0345092 0.0951367 -0.2932606 -0.4086293 -0.1095939 -0.0480841 -0.2252287 -0.5316018 0.0248814 -0.0465331 0.2198009 -0.8558795 -0.5696968 0.1850214 0.0175488 0.4836936 -0.9603471 0.022106 -0.008986 0.0504625 -0.2490965 -0.9342362 -0.0379752 0.0850265 -0.183683 -0.4577505 0.0457317 0.108837 0.0292507 -0.2283441 -1.8441719 0.307028 0.0918637 0.7007427 -0.4270003 -0.1326106 0.3160561 -0.1650551 -0.404915 -0.2302347 0.3231982 -0.0157028 0.1946887 0.0652581 -0.0351342 -0.0002707 -0.0647621 -0.1046414 -0.001886 -0.1909849 0.0060982 0.264595 0.0379074 -0.0441327 -0.0372972 0.0129536 -0.0846075 2.0731964 -0.4570071 -0.166824 -0.6083866 1.2514283 -0.0452423 -0.1758569 -0.0488293 0.2153037 0.940346 0.0479017 0.0434344 0.4639879 0.0600638 -0.1090208 -0.1600746 -0.0492199 0.1203395 1.665259 -0.3704147 -0.1086886 -1.1239312 0.5809667 0.0668864 -0.0973659 0.0435932 0.1636596 -0.2617317 0.2862368 0.0059655 -0.379064 -0.1042975 0.0586889 0.089732 -0.0300729 0.0707064 -0.2344568 -0.2125911 0.0638508 -0.0799973 0.4150717 -0.0192168 0.0517758 0.0028312 0.1112336 -0.6738535 0.2338951 0.0319691 1.0733919 -0.3835049 -0.0742899 -0.0815685 -0.0047588 -0.2347442 -1.2831322 0.388019 0.0984014 -0.1139633 -0.1782997 0.0316021 0.1725582 -0.0344133 -0.0067465 -0.086925 -0.0508676 -0.0619375 -0.0774839 0.0606205 -0.0116549 -0.0073991 -0.0447124 0.029013 1.1821179 -0.2663962 -0.1072769 0.1022474 0.0042754 -0.0240677 -0.1678625 0.0284232 -0.0330437 0.3967024 0.5017556 0.0277047 0.6849841 1.1670132 -0.1120577 0.1754287 -0.1998637 1.0843696 -0.005125 0.0458086 -0.0462095 -0.0670486 0.0004947 0.0820969 -0.0100333 0.0357793 0.0092449 0.1770783 -0.0089222 0.004048 -0.1671041 0.232458 0.0331278 -0.0219347 0.058046 0.2848562 -0.0203448 -0.0652147 0.0308796 -0.0791639 0.0491412 0.0095667 0.0371044 0.0165515 0.1652233 0.1120732 -0.0016298 0.0178405 0.0626 -0.0038451 0.0630187 -0.0145044 0.1135754 -0.0174772 0.1137979 -0.0149912 -0.0493212 0.0094717 0.0326695 -0.1065473 -0.0541261 -0.0824161 -0.044165 -0.0778291 -0.0508252 0.0262146 -0.097231 0.0380788 0.0276939 0.020341 0.0082187 0.1208517 0.1370998 0.0242662 -0.0005325 -0.0019538 0.0609162 0.0098568 0.0075221 0.0052231 0.1559781 0.3951896 -0.0072676 -0.0436854 -0.0254623 0.3438414 -0.0190234 -0.0599832 -0.0459877 0.1180709 unknown
polarizability: 236.2219651|-12.7710045|165.2293451|-14.7867243|-4.3771671|80.453347 unknown
InChI: InChI=1S/C9H8N4O5/c1-4(9(14)15)10-5-2-3-6(13(16)17)8-7(5)11-18-12-8/h2-4,10,14H,1H3
charge 0 multiplicity 1
26 atoms
O  -1.746462 -2.864774 0.234212
O  4.124038 1.972327 0.268126
O  3.463771 0.312643 1.76626
O  -3.53977 2.602752 -0.088137
O  -4.384221 0.49739 0.234113
N  1.924515 -0.793639 -0.46735
N  -0.387727 -2.475004 0.018346
N  -2.655618 -1.718306 0.238768
N  -3.405118 1.316323 0.026761
C  3.142349 -0.013469 -0.684162
C  0.672273 -0.243008 -0.336349
C  -0.449736 -1.128824 -0.106183
C  -1.820528 -0.657345 0.025323
C  0.368349 1.133715 -0.426927
C  -2.064055 0.753721 -0.086573
C  4.298703 -0.941814 -1.123128
C  -0.969437 1.601883 -0.306297
C  3.561704 0.73481 0.599713
H  2.966395 0.742347 -1.470662
H  2.020772 -1.796979 -0.290564
H  1.163942 1.866872 -0.582758
H  4.511841 -1.697658 -0.345858
H  4.033424 -1.455479 -2.06285
H  5.214864 -0.353942 -1.294987
H  -1.179232 2.673458 -0.381649
H  4.448962 2.433699 1.088812
