program: Gaussian 09
title: 000196422
version: EM64L-G09RevD.01
frameworkgroup: C1[X(C10H8IN3O3)]
method: RPBEPBE
basis: SDD
operation: Freq
keyword: #p
keyword: freq=noraman
keyword: PBEPBE/SDD
title: #p freq=noraman PBEPBE/SDD
converged: YES YES NO NO
title: Mulliken charges:
elementType: I O O O N N N C C C C C C C C C C H H H H H H H H
charge: 0.087539 -0.228464 -0.202793 -0.215325 -0.063430 -0.002232 -0.038824 0.306989 0.129526 -0.414054 -0.318730 -0.330879 -0.370571 -0.326456 0.278057 0.377666 -0.862569 0.261022 0.261011 0.245783 0.283156 0.259950 0.249670 0.315369 0.318589
chargesum: 0.00000
title: Mulliken charges with hydrogens summed into heavy atoms:
elementType: I O O O N N N C C C C C C C C C C
charge: 0.087539 -0.228464 -0.202793 -0.215325 -0.063430 -0.002232 -0.038824 0.306989 0.129526 0.107978 -0.072947 -0.047722 -0.110621 -0.076785 0.278057 0.377666 -0.228611
polarizability: 3.22970024e+02 -1.65660747e+01 1.39270112e+02 -1.19780418e+01 -8.92277863e-02 7.77560891e+01
1716.lowfreq: -15.0787 -2.2961 -0.0006 -0.0004 -0.0002 3.1198 9.8648 24.8526 32.1631
frequency: 9.4271 24.7625 32.1066 44.1269 56.1257 80.7300 100.6828 119.1781 129.1271 150.6316 266.1211 277.3499 286.0627 315.0640 354.4656 401.9579 406.6783 455.2957 460.7927 461.8559 478.2607 527.7843 560.6694 623.8925 629.1394 657.2803 707.9484 734.4125 756.8047 785.5265 806.6173 832.9051 846.7314 867.4471 954.6239 963.9513 986.8315 1000.0340 1004.6680 1041.6013 1075.9614 1096.8777 1121.4928 1186.8566 1196.4615 1215.6904 1243.3492 1245.8771 1306.2897 1326.2096 1332.1466 1372.2708 1420.2172 1425.3289 1429.3894 1495.2165 1560.2888 1593.4133 1620.3134 1650.1698 2047.2740 3002.2362 3090.5036 3092.1241 3136.7886 3145.8300 3162.9235 3175.5607 3189.0921
redmass: 8.7712 10.5947 7.4641 5.6704 8.4138 7.6992 10.5687 8.7907 9.7922 7.1443 3.7125 5.7281 4.4141 9.9703 6.6174 4.5595 2.8881 6.3982 9.4750 5.8872 3.5125 7.0947 2.3804 6.9008 6.6699 7.2329 7.3468 3.6455 5.4169 3.9496 6.2818 1.3136 1.4923 1.8456 5.9838 1.4992 1.6455 1.8624 2.6872 3.8698 1.7076 4.6435 1.3571 1.1750 1.1642 2.2727 1.3472 2.1832 1.2960 2.2290 2.7005 5.1712 1.1056 1.1306 4.1436 2.6091 7.3998 7.8300 7.2062 10.2379 13.9629 1.0605 1.0557 1.1005 1.0894 1.0892 1.0958 1.0966 1.1120
irintensity: 0.2434 1.0346 0.3150 0.5608 0.0799 2.3734 2.1924 1.7172 1.7476 3.8595 13.6977 3.5391 4.2238 7.3149 0.5955 15.2479 0.0715 6.4103 1.0467 21.9548 6.4035 21.2467 14.4435 8.4124 7.8618 3.3071 0.4780 0.9990 19.2793 20.4895 1.1420 15.7588 60.0163 4.2459 189.2095 14.2455 1.9737 3.0077 2.8812 4.6960 193.2611 15.8974 23.8072 128.6216 13.7095 387.7629 53.2313 22.5363 0.3867 11.7676 235.2377 20.8719 5.4780 51.6659 19.6985 24.5792 84.8084 287.9000 76.2376 163.4652 665.7268 33.4147 2.2316 4.1696 3.6869 10.9917 4.0960 3.3507 0.1094
temp: 298.150 k
press: 1.00000 atm
elementType: 53 8 8 8 7 7 7 6 6 6 6 6 6 6 6 6 6 1 1 1 1 1 1 1 1
symmnumber: 1
zpe: 443550.3 jmol-1
zpe.correction: 0.168939 hartree
zpe.thermalcorrener: 0.185309 hartree
zpe.thermalcorrenthalpy: 0.186253 hartree
zpe.thermalcorrgfe: 0.119164 hartree
zpe.sumelectzpe: -786.016261 hartree
zpe.sumelectthermal: -785.999892 hartree
zpe.sumelectthermalent: -785.998948 hartree
zpe.sumelectthermalfe: -786.066037 hartree
dipole: -1.9279 -1.6541 -1.4319
dipole: 2.9160
quadrupole: -118.9776 -106.2897 -118.5801
quadrupole: 3.6361 -0.6936 0.0820
quadrupole: -4.3618 8.3261 -3.9643 3.6361 -0.6936 0.0820
hfenergy: -786.1852003 hartree
pointgroup: C01 [X(C10H8I1N3O3)]
dipole: 0.7875112 0.3635828 -0.7508574 debye
dipolederiv: -0.3016106 0.0259182 -0.0359751 0.1060411 -0.0923191 0.0199991 -0.0638589 0.0137028 -0.0534604 -1.3886253 -0.0169754 0.3139713 -0.1736624 -0.2391724 0.0489901 0.742808 -0.0368809 -0.8154921 -1.030562 -0.0959213 -0.0081095 -0.5126363 -0.7139898 0.0686207 0.1529396 0.1218475 -0.2956098 -0.7165006 -0.0734866 -0.1859079 -0.0844906 -0.3040874 -0.2377222 0.2716771 -0.0817111 -0.8542419 -1.7470206 0.2715949 -0.2098299 0.7607876 -0.3911207 0.1476469 -0.394579 0.1108646 -0.1990883 1.7048827 -0.6197717 0.329637 -1.4593262 0.4443398 -0.2292215 0.6272553 -0.1722072 0.1960675 -1.1470489 0.2507006 -0.1646702 0.6842443 -0.1950629 0.0931152 -0.3214811 0.0641978 -0.1133129 -1.2780258 -0.0735446 -0.0451644 -0.1044918 -0.1294342 -0.0020658 -0.0767431 0.0296676 -0.0401602 2.2105144 0.0612418 0.1102562 0.1650874 0.7372321 -0.0967191 0.0779367 -0.2022138 0.1690217 0.492114 0.1124691 -0.1397805 0.4986343 -0.005369 0.0068391 -0.1558119 0.1055975 0.2199493 0.4366576 -0.0264705 0.0504574 0.2208268 0.0596458 -0.0410043 -0.0386141 -0.0572489 -0.1001491 0.2588282 0.0844682 0.004034 -0.1585131 0.0612646 -0.0445893 0.0826591 -0.0401598 -0.0539249 -0.6396215 0.0604294 -0.0498805 0.3019271 0.0453052 -0.0468394 -0.1373414 -0.0592344 -0.1454267 -0.4250439 -0.103739 0.021822 -0.3744945 -0.1080292 -0.0461596 0.1036264 -0.0273514 -0.1437244 1.6717449 0.0368909 0.1040452 0.0693045 0.2034507 -0.0220353 0.111052 -0.0234136 0.1401046 1.7707976 0.1382555 -0.0979853 0.3905965 0.1742091 0.2496058 -0.9615248 0.1604488 1.3844809 -0.0325541 -0.2320853 0.0472425 -0.3647638 0.2086896 -0.0809929 0.0812622 -0.089605 0.0154236 -0.0256655 -0.0087818 0.0500219 -0.0472989 0.0932262 0.0414094 0.082096 0.0481436 -0.0106263 -0.0292644 -0.0095048 0.0032925 -0.07877 0.0176559 -0.0211765 -0.0882881 -0.0824082 0.0601152 0.022707 0.0919065 -0.0444059 0.1186171 0.0209056 0.0427705 -0.0518147 0.0463426 0.1221465 0.1196903 -0.0519492 0.0104484 -0.0085497 0.0318479 0.0377074 -0.0012082 0.0354269 0.1356424 0.0724315 -0.0573078 0.0121648 -0.0591985 0.0016834 0.0505692 0.0121905 0.0494645 0.1519264 -0.0334506 0.0742027 -0.0385524 0.0489521 0.0432085 0.0457426 -0.0339308 0.0477939 0.1493466 -0.0076381 0.066185 -0.0472284 0.0236593 0.0374372 0.0624699 0.0140878 0.0679255 0.0198399 0.0422638 0.0952751 0.0100968 0.0375179 -0.0015168 -0.0469601 -0.0343944 -0.0289891 0.0611523 unknown
polarizability: 320.8926966|-20.6102793|132.9311257|18.9828217|-21.7817631|86.1724033 unknown
InChI: InChI=1S/C10H8IN3O3/c11-5-10(16)17-6-9(15)7-1-3-8(4-2-7)13-14-12/h1-4H,5-6H2
charge 0 multiplicity 1
25 atoms
I  -6.878544 0.677268 -0.206093
O  -3.322156 -0.025665 -0.702231
O  -1.375772 -1.707475 0.177493
O  -3.515565 0.324054 1.600761
N  4.638047 0.738936 -0.137941
N  5.551623 -0.068776 0.211458
N  6.544966 -0.65098 0.492275
C  0.487464 -0.214861 -0.179019
C  -0.962295 -0.571283 -0.182976
C  -1.960764 0.513221 -0.643498
C  0.970146 1.068107 -0.562347
C  1.423336 -1.205122 0.231706
C  2.344776 1.354143 -0.539244
C  2.79866 -0.933859 0.260027
C  3.263833 0.354593 -0.128613
C  -3.984253 -0.116385 0.530401
C  -5.319061 -0.796812 0.354057
H  -1.741785 0.846409 -1.671124
H  -1.921501 1.373782 0.052119
H  0.2788 1.856147 -0.877919
H  1.03673 -2.185966 0.527541
H  2.72776 2.336477 -0.829734
H  3.507864 -1.706126 0.579232
H  -5.660516 -1.22597 1.303951
H  -5.302092 -1.529555 -0.462482
