program: Gaussian 09
title: 000017326
version: EM64L-G09RevD.01
frameworkgroup: C1[X(C7H14)]
method: RPBEPBE
basis: SDD
operation: Freq
keyword: #p
keyword: freq=noraman
keyword: PBEPBE/SDD
title: #p freq=noraman PBEPBE/SDD
converged: YES YES NO NO
title: Mulliken charges:
elementType: C C C C C C C H H H H H H H H H H H H H H
charge: -0.012789 -0.012760 -0.483224 -0.449865 -0.451006 -0.759117 -0.756639 0.211535 0.210081 0.221336 0.180957 0.209386 0.206012 0.205398 0.209478 0.214666 0.208132 0.212960 0.213045 0.207810 0.214604
chargesum: 0.00000
title: Mulliken charges with hydrogens summed into heavy atoms:
elementType: C C C C C C C
charge: 0.198747 0.197321 -0.080931 -0.034467 -0.036130 -0.123360 -0.121180
polarizability: 8.36308519e+01 1.53100315e-02 7.17232157e+01 -7.88244179e-03 3.00662953e-01 6.34291965e+01
1716.lowfreq: -20.6157 -0.0004 0.0007 0.0008 5.1904 29.2066 40.1737 129.6198 217.5772
frequency: 35.4735 129.6003 217.5707 226.4766 260.9443 338.6527 412.1414 421.0251 494.8914 580.6333 773.3119 824.0816 834.3579 883.0663 909.7047 910.3925 949.4471 998.9106 1005.9616 1022.8331 1067.2867 1116.0224 1147.2936 1161.0114 1183.5694 1212.1806 1249.7130 1253.4800 1267.7410 1282.5777 1305.4104 1310.9471 1338.4573 1342.5600 1384.0200 1384.8725 1463.1845 1466.6565 1474.7873 1475.4887 1475.8336 1477.8293 1487.4853 2953.0169 2954.8018 2964.7538 2964.9891 2968.3432 2978.8814 2996.5457 3034.7558 3040.7118 3056.4771 3059.8391 3061.2572 3061.3848 3068.0158
redmass: 1.7560 2.3954 1.2487 1.0288 1.7338 2.1701 2.1878 1.8646 2.9040 3.8497 1.1929 2.7941 2.6037 1.6054 1.4121 1.5795 1.4544 1.2093 2.6307 1.2024 2.3256 2.3096 2.1918 2.3972 1.4796 1.7003 1.2403 1.2582 1.2478 1.3112 1.3056 1.3538 1.5334 1.6856 1.2268 1.2134 1.0941 1.0747 1.0504 1.0537 1.0525 1.0489 1.0884 1.0754 1.0839 1.0361 1.0431 1.0625 1.0604 1.0634 1.1017 1.1005 1.1016 1.0992 1.0992 1.0992 1.1007
irintensity: 0.0005 0.0004 0.1099 0.0028 0.2280 0.0366 0.0045 0.8434 1.0704 0.0699 4.9649 1.4328 2.5128 0.4027 0.0790 0.0917 2.3235 1.6117 2.7006 5.3329 1.7371 3.7079 1.2184 7.5837 1.4479 0.7617 4.1058 0.2055 2.1793 1.5001 0.0017 1.9922 0.9668 6.0750 9.3237 12.4451 5.4999 3.8677 12.2665 2.6416 11.8023 1.8725 15.9150 14.2886 0.7661 56.8107 5.8031 77.4610 43.5040 56.7156 1.3228 23.9999 24.2071 32.7610 33.9836 42.0431 170.8557
temp: 298.150 k
press: 1.00000 atm
elementType: 6 6 6 6 6 6 6 1 1 1 1 1 1 1 1 1 1 1 1 1 1
symmnumber: 1
zpe: 506748.0 jmol-1
zpe.correction: 0.193010 hartree
zpe.thermalcorrener: 0.201086 hartree
zpe.thermalcorrenthalpy: 0.202030 hartree
zpe.thermalcorrgfe: 0.160424 hartree
zpe.sumelectzpe: -274.557777 hartree
zpe.sumelectthermal: -274.549700 hartree
zpe.sumelectthermalent: -274.548756 hartree
zpe.sumelectthermalfe: -274.590363 hartree
dipole: -0.0003 -0.0007 -0.1713
dipole: 0.1713
quadrupole: -47.0812 -46.2328 -45.0736
quadrupole: -0.0025 0.0032 0.0246
quadrupole: -0.9520 -0.1036 1.0556 -0.0025 0.0032 0.0246
hfenergy: -274.7507867 hartree
pointgroup: C01 [X(C7H14)]
dipole: -0.0001411 0.0006171 0.0673792 debye
dipolederiv: 0.0754354 0.0151438 -0.0220291 -0.0112776 0.0959991 0.000527 0.0597408 0.0163776 0.1761016 0.0753513 -0.0157466 0.0218281 0.0117344 0.0956917 -0.0011163 -0.0603293 0.0135051 0.1753517 -0.1227186 -0.0005105 0.0003841 -0.0002792 0.0147086 0.074433 -0.0001174 -0.0055651 0.1495502 -0.017404 -0.0602195 0.0015469 -0.0271279 -0.0009929 -0.0498192 -0.0516472 -0.0323542 0.1410719 -0.0182465 0.0623745 -0.0041001 0.0268293 0.0002875 -0.0530434 0.0515942 -0.0291582 0.1422013 -0.0487711 -0.0397546 0.0408517 -0.0231112 0.0522988 0.0104413 0.0237899 0.0109977 0.0818908 -0.0498485 0.0401417 -0.040076 0.0247668 0.0522117 0.0101685 -0.0231325 0.0105041 0.0829391 0.030424 -0.0049318 0.0176387 0.0025852 0.0204211 0.0013997 -0.0252324 -0.0078809 -0.2109133 0.0313109 0.0050021 -0.0187058 -0.0031581 0.0210265 0.0038912 0.023374 -0.0047836 -0.2114183 0.0625834 0.0005669 0.0000824 0.0003045 -0.1768858 -0.0834904 0.0002353 -0.1100068 0.0305732 0.0438965 0.0002232 -0.0001381 0.0001971 0.0557285 0.0135363 0.0000512 0.0760745 -0.1829772 -0.0064698 0.0785263 -0.0552632 0.0850592 -0.0884615 0.0839478 -0.0712469 0.125966 -0.0069054 -0.0104459 0.0360225 0.0728281 0.0101971 0.0543204 -0.0164349 0.1065826 -0.0800169 -0.1328684 -0.0043088 -0.0295596 -0.068674 -0.004581 0.0573261 -0.0094308 -0.1026817 -0.0743779 -0.141615 -0.011105 -0.0863099 0.0543282 -0.0914392 -0.0935381 0.0796014 0.0692588 0.1202982 0.0030986 -0.1231577 0.0930998 -0.031783 0.1565233 -0.0050362 0.0457894 -0.0438697 0.0476358 0.0674559 0.0625989 -0.0056479 -0.0569316 -0.009378 0.0816096 -0.0140194 0.0249461 0.0139408 -0.1781929 0.0451658 -0.0555801 -0.0008207 -0.122864 -0.1570647 -0.0641108 -0.01251 -0.0762911 0.0632895 0.0443967 0.0557361 0.0015381 0.12292 -0.1544038 -0.0670408 0.0144528 -0.0792274 0.0614265 0.0630137 0.0050065 0.0563873 0.0094894 0.0818928 -0.010782 -0.0261542 0.0170196 -0.1783958 -0.1217007 -0.093583 0.031108 -0.1573903 -0.0071395 0.0455523 0.0428956 0.0473429 0.0683363 unknown
polarizability: 83.6308497|-0.0155423|71.7259303|0.0097133|0.260538|63.426484 unknown
InChI: InChI=1S/C7H14/c1-6-3-4-7(2)5-6/h6-7H,3-5H2,1-2H3
charge 0 multiplicity 1
21 atoms
C  1.220287 0.151404 0.35969
C  -1.219757 0.14602 0.356184
C  -0.001377 1.028088 -0.017652
C  0.784891 -1.284418 -0.081185
C  -0.780346 -1.280336 -0.104919
C  2.556392 0.613465 -0.250951
C  -2.56004 0.610785 -0.242763
H  1.314136 0.164347 1.466541
H  -1.307648 0.144702 1.463714
H  -0.003801 2.008277 0.494914
H  -0.001118 1.220891 -1.111624
H  1.194106 -2.056299 0.595977
H  1.187364 -1.497783 -1.090457
H  -1.151663 -1.462156 -1.132372
H  -1.215939 -2.067777 0.536954
H  3.386486 -0.058974 0.037074
H  2.497183 0.619819 -1.356662
H  2.821491 1.635607 0.079434
H  -2.827203 1.627801 0.101376
H  -2.505804 0.630842 -1.348573
H  -3.38644 -0.068103 0.040701
