program: Gaussian 09
title: 000196449
version: EM64L-G09RevD.01
frameworkgroup: C1[X(C18H16O6)]
method: RPBEPBE
basis: SDD
operation: Freq
keyword: #pfreq=noraman
keyword: PBEPBE/SDD
title: #p freq=noraman PBEPBE/SDD
converged: YES YES NO NO
title: Mulliken charges:
elementType: O O O O O O C C C C C C C C C C C C C C C C C C H H H H H H H H H H H H H H H H
charge: -0.278695 -0.288021 -0.279849 -0.269628 -0.202555 -0.224621 0.162305 0.277602 -0.476677 0.472562 -0.512259 0.388132 0.234200 -0.343122 -0.301206 -0.363320 -0.387611 -0.228173 -0.225600 -0.231683 0.270617 0.261409 -0.751516 -0.748847 0.225870 0.243574 0.301674 0.257582 0.309765 0.265796 0.233277 0.229035 0.228208 0.230842 0.246751 0.241853 0.274838 0.255031 0.254372 0.248088
chargesum: 0.00000
title: Mulliken charges with hydrogens summed into heavy atoms:
elementType: O O O O O O C C C C C C C C C C C C C C C C C C
charge: -0.278695 -0.288021 -0.279849 -0.269628 -0.202555 -0.224621 0.162305 0.277602 -0.007233 0.472562 -0.210585 0.388132 0.234200 -0.085540 0.008559 -0.097524 -0.154335 0.000862 0.002607 -0.000840 0.270617 0.261409 0.011926 0.008643
polarizability: 2.54217034e+02 -1.45491618e+01 2.52399259e+02 3.62445628e+00 -1.64567573e+01 1.53080437e+02
1716.lowfreq: -1.7375 0.0007 0.0007 0.0010 5.2099 6.0935 13.6776 22.7535 30.0123
frequency: 13.2980 22.7531 29.9899 36.7148 42.8180 50.3505 71.6711 76.3754 90.1894 100.0827 101.7506 108.7993 134.8356 164.9332 172.8294 205.4539 228.8721 253.5961 272.3883 300.4043 334.8812 348.1546 373.4601 397.5209 404.4915 416.1256 443.1069 473.8939 496.3356 512.8522 531.3735 548.6896 556.3159 592.6207 601.5130 617.2964 636.6422 681.8011 690.6693 703.3762 709.1758 744.0578 756.8570 766.6047 796.2554 816.8819 848.5802 858.2675 862.1496 878.8446 931.6816 933.5315 940.6536 975.6301 982.9641 983.3509 986.5256 990.2590 996.2828 1001.5223 1025.0013 1028.3143 1037.3525 1040.4294 1091.0390 1132.1718 1139.9323 1163.4134 1173.9176 1175.6737 1189.9069 1199.6445 1222.5239 1234.3696 1243.8182 1257.7251 1331.2858 1349.4865 1377.9288 1382.6878 1385.7757 1386.4360 1404.8383 1442.7735 1449.7264 1452.1042 1453.5572 1454.4060 1462.1750 1472.3939 1484.9277 1565.5232 1594.4411 1604.2079 1614.7384 1627.1536 1660.4453 1695.7540 3009.2589 3010.2342 3040.7118 3097.1968 3104.1851 3114.3722 3120.1285 3128.6198 3140.7484 3143.9068 3145.8047 3151.8093 3165.6136 3169.8836 3196.3660 3214.4614
redmass: 4.8773 6.5370 5.1465 5.8702 3.9966 5.2298 1.2940 2.9901 4.1873 3.9014 2.6742 1.4178 8.3411 6.3182 5.9426 7.1577 7.3731 5.0612 5.5875 7.3581 3.6132 3.5152 6.2388 2.9931 2.8341 6.2917 3.6915 4.0614 4.7093 4.1824 4.1617 3.8341 3.4438 4.6351 4.5781 6.2907 5.8351 5.3736 6.1091 2.0480 5.2552 5.5231 2.2271 4.4799 5.0054 3.5580 2.7365 1.3393 2.1687 6.1636 1.5161 1.9790 2.7477 1.8636 1.3340 1.4145 2.1601 5.3669 1.9759 1.3349 3.1445 2.5934 1.6482 1.6402 1.5209 1.7721 2.1832 2.8776 1.0543 3.5532 1.1225 3.2612 2.8873 1.3116 3.2060 1.3531 1.2574 1.3029 1.2490 2.9719 7.3406 1.7511 3.9794 2.1778 1.0567 1.0606 1.0465 1.0516 1.1351 2.9789 2.2944 7.6316 6.1783 9.5448 6.0673 8.1476 9.6711 10.7004 1.0368 1.0366 1.0583 1.0973 1.0960 1.1071 1.0875 1.0872 1.0920 1.1022 1.1011 1.0964 1.1016 1.0914 1.0920 1.0952
irintensity: 0.0437 0.2466 2.0066 1.4659 1.5490 2.7814 0.4427 6.2297 0.1204 1.6091 1.5762 0.1266 0.3685 0.7219 3.3566 2.0152 9.1279 2.0560 1.9636 1.2067 2.4766 2.9786 0.9058 13.1370 0.1652 7.1217 1.3718 8.0288 6.5507 14.1276 12.5717 8.0577 0.6637 42.4644 13.3600 0.6281 5.0383 2.9683 4.1531 52.1006 6.7667 13.1482 74.1795 1.5530 5.4441 9.1648 65.1953 5.8676 51.4788 93.7821 21.2929 66.7504 66.3301 3.0586 0.7178 1.4006 161.3659 5.7324 145.9884 0.3689 205.6714 68.5936 9.3564 9.0724 7.2255 169.1953 545.8399 379.1006 0.5191 185.0805 0.8380 72.1833 32.3407 76.5063 210.6211 5.0486 1.5903 23.7224 88.7672 7.9540 0.1744 56.0819 17.7221 9.4474 17.7905 26.3621 19.2061 21.8175 28.6985 136.5123 10.1633 72.7163 8.5551 116.7205 0.6767 71.5097 203.0210 160.7825 0.9552 1.5047 32.5215 5.8368 6.9617 3.3197 6.6180 1.4776 17.7058 10.4927 10.5717 25.3531 21.7603 3.1030 4.4687 5.6936
temp: 298.150 k
press: 1.00000 atm
elementType: 8 8 8 8 8 8 6 6 6 6 6 6 6 6 6 6 6 6 6 6 6 6 6 6 1 1 1 1 1 1 1 1 1 1 1 1 1 1 1 1
symmnumber: 1
zpe: 786907.1 jmol-1
zpe.correction: 0.299717 hartree
zpe.thermalcorrener: 0.322766 hartree
zpe.thermalcorrenthalpy: 0.323710 hartree
zpe.thermalcorrgfe: 0.242872 hartree
zpe.sumelectzpe: -1145.152300 hartree
zpe.sumelectthermal: -1145.129251 hartree
zpe.sumelectthermalent: -1145.128307 hartree
zpe.sumelectthermalfe: -1145.209145 hartree
dipole: -1.6241 -2.7656 -0.6020
dipole: 3.2632
quadrupole: -135.0064 -116.7895 -138.3118
quadrupole: -3.6765 4.1786 -11.3712
quadrupole: -4.9705 13.2464 -8.2759 -3.6765 4.1786 -11.3712
hfenergy: -1145.4520172 hartree
pointgroup: C01 [X(C18H16O6)]
dipole: 1.0786186 -0.66673 0.2007734 debye
polarizability: 241.4048817|6.4759532|256.1184724|2.5091897|35.2627647|162.173376 unknown
InChI: InChI=1S/C18H16O6/c1-12(19)23-15-8-9-17(24-13(2)20)16(10-15)18(21)22-11-14-6-4-3-5-7-14/h3-10H,11H2,1-2H3
charge 0 multiplicity 1
40 atoms
O  1.230533 0.410683 -1.147002
O  -2.252989 2.003983 0.945038
O  -1.886441 -3.268639 -1.043137
O  0.413064 2.223693 0.066461
O  -2.253355 3.052842 -1.15696
O  -3.968756 -4.214892 -0.46927
C  -0.972717 0.222385 -0.247795
C  -2.152123 0.701813 0.395092
C  2.52694 1.155207 -1.354478
C  3.539015 0.81217 -0.284074
C  -0.961702 -1.118642 -0.703753
C  -2.077608 -1.95457 -0.517697
C  0.248007 1.068802 -0.403383
C  -3.259489 -0.146411 0.581947
C  -3.242538 -1.483304 0.135781
C  3.56618 1.535277 0.937053
C  4.475957 -0.232086 -0.490107
C  4.511083 1.213007 1.935446
C  5.422946 -0.554172 0.507574
C  5.441697 0.168372 1.723305
C  -2.176052 3.144655 0.077645
C  -2.839635 -4.312609 -0.989223
C  -2.010835 4.385668 0.912201
C  -2.257164 -5.535725 -1.659442
H  2.846315 0.810537 -2.350304
H  2.293402 2.23323 -1.371101
H  -0.071379 -1.509977 -1.199468
H  -4.143685 0.257347 1.083368
H  -4.104088 -2.133972 0.284115
H  2.838532 2.338549 1.098303
H  4.461981 -0.793412 -1.432651
H  4.525016 1.775974 2.875299
H  6.144095 -1.361435 0.337879
H  6.176568 -0.079126 2.497643
H  -2.641893 4.342971 1.814313
H  -2.247632 5.277618 0.31428
H  -0.956096 4.431999 1.237879
H  -2.015091 -5.311696 -2.712833
H  -1.316672 -5.830272 -1.162912
H  -2.981088 -6.361439 -1.611033
