program: Gaussian 09
title: 000017321
version: EM64L-G09RevD.01
frameworkgroup: C1[X(C15H12)]
method: RPBEPBE
basis: SDD
operation: Freq
keyword: #p
keyword: freq=noraman
keyword: PBEPBE/SDD
title: #p freq=noraman PBEPBE/SDD
converged: YES YES YES YES
title: Mulliken charges:
elementType: C C C C C C C C C C C C C C C H H H H H H H H H H H H
charge: 0.218220 0.211742 0.423775 0.420977 -0.484911 -0.648359 -0.376666 -0.478436 0.463703 -0.373963 -0.387479 -0.432628 -0.257118 -0.250308 -0.812619 0.235710 0.241656 0.221241 0.234187 0.222732 0.229820 0.238566 0.226384 0.228161 0.225188 0.230218 0.230210
chargesum: 0.00000
title: Mulliken charges with hydrogens summed into heavy atoms:
elementType: C C C C C C C C C C C C C C C
charge: 0.218220 0.211742 0.423775 0.420977 -0.249202 -0.406703 -0.155425 -0.244249 0.463703 -0.151231 -0.157659 -0.194063 -0.030734 -0.022147 -0.127003
polarizability: 2.76584263e+02 -4.10238799e-01 1.69454392e+02 4.59374442e-03 2.72580690e-04 6.65250406e+01
1716.lowfreq: -7.9749 -6.4773 -0.0009 -0.0005 0.0003 9.8871 68.5637 79.7796 101.1549
frequency: 68.5610 79.7780 101.1526 182.8168 197.1225 227.5884 309.5653 312.8126 381.8775 395.9821 434.8398 455.1265 492.4787 523.1188 536.6270 549.3619 567.4791 615.5928 670.6963 714.6587 729.0625 756.7937 768.0159 793.1207 828.8230 834.9923 856.4751 887.0109 907.4618 927.4971 952.9047 966.3735 981.4426 989.8268 990.9110 1003.6108 1039.5298 1049.0103 1096.6851 1152.6571 1166.5817 1176.6946 1187.8260 1231.3729 1249.5398 1266.0335 1280.9099 1315.4535 1377.2303 1396.9951 1400.6348 1402.5179 1426.1038 1447.9881 1461.8736 1469.3807 1475.6114 1500.6302 1533.9595 1578.2564 1609.6726 1627.1230 1634.0161 2974.7484 3051.8050 3084.9041 3112.9450 3116.7774 3119.7435 3120.5847 3131.9218 3141.8232 3147.1545 3154.2385 3165.1856
redmass: 1.7555 1.5550 3.5603 3.7596 3.7743 3.6644 3.7108 3.7420 4.6810 3.1191 2.8239 4.1761 5.5706 2.9820 2.9091 7.1070 5.7728 2.9984 5.5512 5.8982 2.8236 1.2832 5.6720 1.6761 1.5181 1.5111 4.6990 1.9970 1.5848 2.9052 1.4057 1.3559 1.3793 5.6970 1.3774 1.6244 2.1834 1.5681 2.2554 1.3406 1.3391 1.0945 1.4200 2.0483 1.7764 2.2166 1.6001 2.1382 2.3719 1.2649 4.2338 4.4023 2.7542 3.6050 1.8581 1.0457 1.5437 2.6463 3.7339 7.4168 5.8604 6.6138 6.5172 1.0373 1.0974 1.0987 1.0910 1.0866 1.0869 1.0872 1.0885 1.0983 1.0951 1.0942 1.0988
irintensity: 1.5043 0.0760 0.0221 0.0718 0.7027 4.6695 0.1698 1.1367 0.1462 0.0814 16.1889 3.2118 1.0913 0.3289 0.0513 0.2703 1.7342 3.9415 3.5489 0.1359 10.2494 63.4864 0.3942 5.0915 31.9261 40.7413 2.1834 7.2773 22.8620 0.1663 2.5946 3.3395 0.0387 0.9128 0.0846 8.6071 6.6383 13.4796 4.9170 1.3335 0.5396 0.6050 1.5903 3.7061 12.5657 7.3825 0.2265 0.8778 2.2805 8.0399 0.2425 1.3895 3.3494 3.8884 14.1092 13.2176 19.5856 8.1955 3.7544 0.0807 4.0479 0.5173 18.7849 46.8817 21.2757 17.3351 14.8348 6.7374 15.9871 2.4960 8.5202 35.2141 9.0214 36.6676 36.3059
temp: 298.150 k
press: 1.00000 atm
elementType: 6 6 6 6 6 6 6 6 6 6 6 6 6 6 6 1 1 1 1 1 1 1 1 1 1 1 1
symmnumber: 1
zpe: 573416.0 jmol-1
zpe.correction: 0.218403 hartree
zpe.thermalcorrener: 0.229858 hartree
zpe.thermalcorrenthalpy: 0.230802 hartree
zpe.thermalcorrgfe: 0.180947 hartree
zpe.sumelectzpe: -577.813093 hartree
zpe.sumelectthermal: -577.801638 hartree
zpe.sumelectthermalent: -577.800694 hartree
zpe.sumelectthermalfe: -577.850550 hartree
dipole: -0.6506 -0.1237 0.0009
dipole: 0.6623
quadrupole: -72.8216 -75.8387 -94.8320
quadrupole: 0.4275 0.0002 0.0032
quadrupole: 8.3425 5.3254 -13.6679 0.4275 0.0002 0.0032
hfenergy: -578.0314961 hartree
pointgroup: C01 [X(C15H12)]
dipole: 0.2558914 -0.0490695 0.0009012 debye
polarizability: 276.5853081|0.2373643|169.3871328|0.0070195|-2.6097631|66.5912549 unknown
InChI: InChI=1S/C15H12/c1-11-6-9-15-13(10-11)8-7-12-4-2-3-5-14(12)15/h2-10H,1H3
charge 0 multiplicity 1
27 atoms
C  0.386573 -0.360619 0.008145
C  -1.078479 -0.388383 0.008763
C  1.069281 0.908901 -0.023957
C  -1.804782 0.858961 -0.022984
C  0.301147 2.134165 -0.055176
C  2.4985 0.948239 -0.025074
C  1.190483 -1.541973 0.03798
C  -1.07998 2.109925 -0.054712
C  3.273906 -0.220106 0.004475
C  -1.832832 -1.602281 0.039537
C  2.588325 -1.475605 0.036318
C  -3.234282 0.847503 -0.022994
C  -3.234643 -1.591531 0.039011
C  -3.945724 -0.357353 0.007458
C  4.791159 -0.173963 0.003177
H  0.841839 3.087836 -0.079597
H  2.993115 1.927717 -0.050225
H  0.713948 -2.527054 0.062878
H  -1.65431 3.043752 -0.078697
H  -1.315729 -2.566526 0.064332
H  3.17461 -2.402578 0.05978
H  -3.768352 1.805121 -0.047639
H  -3.787042 -2.537431 0.063105
H  -5.041124 -0.355546 0.007147
H  5.164828 0.863842 -0.023282
H  5.208019 -0.66081 0.905185
H  5.207847 -0.706103 -0.872954
