program: Gaussian 09
title: 000188189
version: EM64L-G09RevD.01
frameworkgroup: C1[X(C20H24)]
method: RPBEPBE
basis: SDD
operation: Freq
keyword: #p
keyword: freq=noraman
keyword: PBEPBE/SDD
title: #p freq=noraman PBEPBE/SDD
converged: YES YES NO NO
title: Mulliken charges:
elementType: C C C C C C C C C C C C C C C C C C C C H H H H H H H H H H H H H H H H H H H H H H H H
charge: 0.391265 -0.267345 -0.484663 -0.545123 -0.478475 0.372318 -0.416058 -0.396006 -0.552355 -0.794983 0.070257 -0.479092 0.236308 0.217570 -0.455421 -0.417503 0.328713 -0.261632 -0.464853 -0.837093 0.205381 0.196526 0.193380 0.208952 0.218902 0.214248 0.220080 0.206260 0.196431 0.186296 0.204788 0.234146 0.217913 0.243414 0.209039 0.208873 0.235227 0.240069 0.245493 0.221790 0.230055 0.231217 0.235265 0.230427
chargesum: 0.00000
title: Mulliken charges with hydrogens summed into heavy atoms:
elementType: C C C C C C C C C C C C C C C C C C C C
charge: 0.391265 -0.061964 -0.094757 -0.117269 -0.044147 0.372318 -0.013367 -0.004922 -0.100296 -0.133657 0.070257 -0.243864 0.236308 0.217570 -0.215353 -0.172010 0.328713 -0.039842 -0.234797 -0.140184
polarizability: 2.99172317e+02 9.08546299e+00 2.11031297e+02 5.49586879e+00 1.26796879e+01 1.37040496e+02
1716.lowfreq: -11.8016 -0.0006 -0.0003 -0.0002 2.2247 12.4745 48.6671 61.9875 113.7113
frequency: 48.5838 61.8102 113.6740 132.7831 160.2128 175.3879 186.7498 200.5861 212.2287 226.0037 245.9418 262.9498 285.8256 313.3101 326.4280 349.7200 368.0901 411.5739 417.3084 456.1842 460.0559 464.8247 486.3203 512.9586 521.4820 546.1443 557.6098 570.4722 584.8062 645.5526 663.9285 725.9371 739.8474 763.8155 791.8856 807.8022 825.8272 830.9836 835.5906 849.4971 857.3648 877.0224 901.9758 904.9130 920.8060 955.0278 966.3830 972.7939 978.8142 987.6418 992.5565 1008.9257 1037.6761 1044.9722 1048.3955 1059.6725 1087.7181 1099.8072 1104.0901 1121.7166 1145.2017 1152.4177 1173.4245 1181.8032 1191.3448 1205.9154 1216.0819 1223.9866 1238.7778 1245.0830 1258.9123 1263.7411 1281.8918 1301.6755 1305.3227 1318.2237 1329.8556 1337.3401 1342.7583 1347.2038 1356.4140 1368.6888 1387.3461 1391.8364 1397.2666 1412.6995 1430.0974 1450.6727 1455.8468 1462.3144 1464.6712 1468.2808 1471.4861 1472.1499 1475.4186 1484.6703 1487.0920 1491.3875 1518.6006 1585.5102 1605.9592 1623.3281 2936.9344 2950.0656 2955.6147 2962.4434 2968.8665 2971.4871 2972.8058 2977.3495 2979.6177 3005.9230 3008.7031 3024.3997 3029.4913 3033.6164 3042.4609 3046.3719 3055.8996 3078.3149 3084.4377 3108.4757 3119.4509 3139.3722 3153.8252 3163.3838
redmass: 4.0074 3.3306 3.1856 3.0154 2.8346 2.2027 1.2759 2.2811 1.9174 2.8381 2.3028 1.7116 2.6081 2.7838 1.9571 2.8867 2.3674 3.1117 2.6917 3.3206 3.6695 3.5976 3.2008 4.6214 3.2111 2.4714 3.3345 3.2666 4.2202 4.4690 2.9130 2.4029 3.1189 1.6024 1.7560 2.4250 2.8731 2.0892 3.8001 1.8870 2.1991 2.1552 1.4583 1.6240 1.8660 1.9599 1.3833 1.7227 1.5032 1.7592 1.7228 1.7973 2.4503 1.5569 1.8483 2.1045 1.8655 1.6607 1.5568 1.9400 1.8661 1.9183 1.6423 1.3900 1.6814 1.5293 1.7065 1.4687 1.6348 1.9410 1.8257 1.4410 1.4750 1.6548 1.6947 1.3785 1.3940 1.4035 1.5012 1.5029 1.6526 2.5625 1.9899 1.3104 1.3599 5.2234 3.1873 1.4222 1.0909 1.1243 1.0875 1.4017 1.0470 1.0782 1.0805 1.1485 1.1164 1.0944 4.2130 7.4654 5.7735 6.7307 1.0819 1.0607 1.0631 1.0622 1.0380 1.0376 1.0637 1.0613 1.0625 1.0952 1.0969 1.0953 1.1022 1.1022 1.1018 1.0973 1.0987 1.0978 1.0980 1.0879 1.0867 1.0917 1.0941 1.0966
irintensity: 0.1957 0.0436 0.6171 0.0901 0.0467 0.0448 1.5937 0.3899 0.4946 0.2139 3.1288 3.1734 0.9609 0.7248 0.0651 0.8517 0.0558 0.1584 0.1668 0.1084 0.6566 0.4102 1.5527 4.4799 1.9471 2.5017 2.0740 0.6167 0.4051 0.1913 0.6247 5.2539 3.4597 23.0704 10.6451 31.3827 10.3934 25.9090 1.4157 2.3878 0.7170 1.4376 0.1422 2.8265 2.4298 3.6192 0.2791 0.6966 0.5537 4.5467 6.3787 6.4357 0.7057 6.4245 1.2094 2.9220 10.7258 0.6444 1.6731 0.4116 0.0906 8.7804 0.9988 0.5900 1.0351 3.0484 3.5004 3.4713 0.2555 6.6772 1.4389 0.7189 2.1454 0.8369 2.7949 0.7426 0.1733 0.9045 1.6882 0.0889 2.0832 1.6334 7.9781 16.2366 15.6560 0.0263 28.4599 2.4058 6.3462 9.8082 7.9370 8.6651 14.2901 16.9398 3.1739 7.1168 12.8947 2.7829 10.3894 0.7702 11.5590 8.8393 18.2052 42.6192 20.7857 43.0985 40.2842 40.2750 13.3427 71.5297 15.0327 11.9137 66.6298 77.4315 31.1806 23.9524 93.3942 21.4465 40.2748 41.8379 23.4724 14.0161 10.8485 28.8572 21.4340 25.3358
temp: 298.150 k
press: 1.00000 atm
elementType: 6 6 6 6 6 6 6 6 6 6 6 6 6 6 6 6 6 6 6 6 1 1 1 1 1 1 1 1 1 1 1 1 1 1 1 1 1 1 1 1 1 1 1 1
symmnumber: 1
zpe: 1005826.0 jmol-1
zpe.correction: 0.383099 hartree
zpe.thermalcorrener: 0.400198 hartree
zpe.thermalcorrenthalpy: 0.401142 hartree
zpe.thermalcorrgfe: 0.340115 hartree
zpe.sumelectzpe: -775.098563 hartree
zpe.sumelectthermal: -775.081464 hartree
zpe.sumelectthermalent: -775.080520 hartree
zpe.sumelectthermalfe: -775.141546 hartree
dipole: 0.7147 0.1981 -0.0401
dipole: 0.7428
quadrupole: -112.3528 -113.0127 -124.5383
quadrupole: -1.4172 0.2098 3.0222
quadrupole: 4.2818 3.6219 -7.9037 -1.4172 0.2098 3.0222
hfenergy: -775.4816617 hartree
pointgroup: C01 [X(C20H24)]
dipole: 0.2823975 -0.0730484 0.0176389 debye
polarizability: 299.505157|-7.6885008|210.9205735|-4.8695407|12.0350152|136.818379 unknown
InChI: InChI=1S/C20H24/c1-14-6-5-7-16-15(14)9-10-18-17(16)11-13-20(2)12-4-3-8-19(18)20/h5-7,9-10,19H,3-4,8,11-13H2,1-2H3
charge 0 multiplicity 1
44 atoms
C  2.664439 0.654019 -0.593014
C  1.976754 -0.725378 -0.334901
C  4.211413 0.527118 -0.442858
C  2.091626 1.675922 0.427113
C  2.488807 -1.431224 0.962732
C  0.451509 -0.617092 -0.278048
C  4.681993 -0.158626 0.860184
C  4.027321 -1.5499 1.002944
C  0.56329 1.867903 0.294449
C  2.366789 1.125295 -2.04182
C  -0.214798 0.575567 0.057337
C  -0.313759 -1.802695 -0.531054
C  -1.662656 0.593861 0.133269
C  -2.421907 -0.619219 -0.109937
C  -1.702541 -1.813798 -0.446478
C  -2.384663 1.796287 0.442522
C  -3.865177 -0.605397 -0.020463
C  -3.778242 1.796155 0.519024
C  -4.515558 0.595241 0.292166
C  -4.673136 -1.869334 -0.259715
H  2.242157 -1.393392 -1.184397
H  4.662259 1.537003 -0.529676
H  4.596564 -0.062516 -1.302163
H  2.59476 2.654373 0.293397
H  2.325882 1.340386 1.454896
H  2.020935 -2.432457 1.03153
H  2.137503 -0.867795 1.850145
H  4.422551 0.462952 1.740648
H  5.785766 -0.24935 0.853268
H  4.371194 -2.202476 0.173112
H  4.344701 -2.034886 1.946509
H  0.346776 2.566865 -0.540485
H  0.188874 2.370393 1.207658
H  1.283789 1.18658 -2.246109
H  2.809386 2.122982 -2.228123
H  2.80366 0.420785 -2.775317
H  0.222944 -2.721007 -0.80253
H  -2.25169 -2.739224 -0.646444
H  -1.83991 2.728586 0.616858
H  -4.315101 2.721968 0.755111
H  -5.609753 0.613406 0.361818
H  -4.397938 -2.671723 0.451184
H  -5.751538 -1.670956 -0.140935
H  -4.515473 -2.270604 -1.279107
