program: Gaussian 09
title: 000188188
version: EM64L-G09RevD.01
frameworkgroup: C1[X(C7H6ClNOS)]
method: RPBEPBE
basis: SDD
operation: Freq
keyword: #p
keyword: freq=noraman
keyword: PBEPBE/SDD
title: #p freq=noraman PBEPBE/SDD
converged: NO NO NO NO
title: Mulliken charges:
elementType: Cl S O N C C C C C C C H H H H H H
charge: -0.033810 0.477324 -0.635555 -0.596705 0.559320 -0.362188 -0.353531 -0.210832 -0.202911 -0.269291 -0.107549 0.234766 0.250898 0.262008 0.262693 0.327471 0.397892
chargesum: 0.00000
title: Mulliken charges with hydrogens summed into heavy atoms:
elementType: Cl S O N C C C C C C C
charge: -0.033810 0.477324 -0.635555 0.128658 0.559320 -0.127422 -0.102633 0.051176 0.059782 -0.269291 -0.107549
polarizability: 2.35426092e+02 5.61017760e+00 1.10150409e+02 3.01819436e-01 -1.50177439e-01 4.48025224e+01
1716.lowfreq: -0.0030 -0.0022 -0.0018 1.0545 10.0806 15.4325 45.8559 69.8401 111.1327
frequency: 45.7822 69.7212 111.1182 167.1847 233.4551 267.1146 288.0706 302.5423 391.2661 404.9879 454.3860 473.4048 518.3970 569.4316 608.2360 627.0008 697.8634 711.9113 727.8731 821.8825 832.4919 844.7164 929.6765 951.1402 965.8208 995.0283 1074.3934 1113.1641 1154.1616 1190.3295 1275.7302 1298.0038 1361.6031 1402.4235 1424.9248 1479.5567 1550.8113 1568.9698 1596.5905 2886.6609 3139.4599 3141.8387 3173.6752 3176.7761 3617.0796
redmass: 5.2025 8.3187 10.5290 11.1062 10.5092 10.3062 5.3193 5.1789 5.5563 2.8776 5.2880 4.3944 1.2649 3.1675 8.0870 7.0465 6.1620 3.6998 15.9222 1.3155 1.6348 3.0038 1.0983 1.3511 1.3715 3.9800 3.0010 1.3844 2.3602 1.1295 1.9409 1.2717 4.4204 3.8685 1.8724 2.0272 3.5964 5.4990 5.5318 1.0640 1.0893 1.0901 1.0955 1.0965 1.0831
irintensity: 2.9921 1.0313 5.5037 2.1371 0.0835 4.0998 6.9619 0.8809 6.9048 0.6236 32.1978 17.6210 94.4108 39.1978 1.1798 1.6489 15.9929 11.2479 71.5429 15.2621 58.4386 15.2145 132.7830 1.3988 0.6724 26.0035 54.4425 12.7675 5.1799 0.1950 34.9371 1.1879 15.4131 3.7768 1.1185 160.9432 117.0478 45.1138 64.7749 19.3222 6.7457 2.9182 3.7536 0.5647 60.6715
temp: 298.150 k
press: 1.00000 atm
elementType: 17 16 8 7 6 6 6 6 6 6 6 1 1 1 1 1 1
symmnumber: 1
zpe: 302874.5 jmol-1
zpe.correction: 0.115359 hartree
zpe.thermalcorrener: 0.125654 hartree
zpe.thermalcorrenthalpy: 0.126599 hartree
zpe.thermalcorrgfe: 0.078214 hartree
zpe.sumelectzpe: -1257.604090 hartree
zpe.sumelectthermal: -1257.593794 hartree
zpe.sumelectthermalent: -1257.592850 hartree
zpe.sumelectthermalfe: -1257.641234 hartree
dipole: 3.6107 2.2326 0.6704
dipole: 4.2978
quadrupole: -108.5797 -63.7292 -81.0494
quadrupole: -4.9888 -1.8289 0.0670
quadrupole: -24.1269 20.7235 3.4034 -4.9888 -1.8289 0.0670
hfenergy: -1257.7194484 hartree
pointgroup: C01 [X(C7H6Cl1N1O1S1)]
dipole: 1.4297452 0.870659 0.2384532 debye
dipolederiv: -1.0268828 0.0645619 0.0222782 0.0943929 -0.1155895 0.0096149 0.014057 0.0073944 -0.0556955 0.5214737 0.1450607 0.0225348 -0.222108 -0.182165 -0.0774323 -0.0775326 -0.0766175 0.1683135 -0.9751161 -0.29257 -0.0682406 0.3931323 -0.2854338 0.0243324 0.1335921 0.0400686 -0.4567246 -0.22594 0.303667 0.0903179 0.0189449 -1.0212127 -0.1114469 0.0396244 -0.0225803 -0.4982712 0.194984 0.1499256 0.0272296 -0.0150247 -0.0718728 -0.0156402 0.0702149 -0.0056226 0.0575782 0.0198449 -0.060266 0.003437 -0.0280156 0.020196 -0.0567846 0.0192853 -0.0556991 -0.1402531 -0.0447011 0.0001489 -0.0489833 0.0020106 0.0432247 -0.0410625 -0.0555178 -0.0103963 -0.1202659 -0.3557466 0.1135784 -0.0175431 0.2446225 -0.0122842 -0.0172119 -0.0477864 -0.0267732 -0.0837901 -0.2920136 -0.048008 0.0280087 -0.0848535 0.0448431 -0.016985 0.0440815 -0.0255802 -0.079911 0.3518578 -0.2328237 -0.0476281 0.136758 0.897485 0.2524083 -0.0515929 0.1590291 -0.0226592 1.3433654 -0.1128523 -0.0389585 -0.2172154 0.1187259 -0.035794 -0.0025 -0.0292264 -0.0659237 0.0360156 0.0977923 -0.0086778 0.0649821 -0.0336189 0.0398375 -0.014857 0.0279457 0.145951 0.0149556 -0.0876242 0.0281071 -0.0487869 0.0341942 0.0330281 0.0207523 0.0162983 0.1421498 0.0330763 -0.0652342 0.0178009 -0.065791 0.0244708 0.0307024 0.0139461 0.0327419 0.1584907 0.0605044 0.0533695 -0.0053779 0.0586339 0.0054542 0.0294064 -0.0036177 0.0304379 0.158618 0.2449815 -0.0798781 -0.0218804 -0.0909171 0.2692218 -0.0278997 -0.0415881 -0.0365213 0.3619595 0.0993409 0.0511522 0.0175755 -0.2407651 0.2643613 -0.0190728 -0.0605611 -0.0248989 0.3304334 unknown
polarizability: 235.4885638|4.6505952|110.0593396|-1.7406242|-0.9828392|44.8311201 unknown
InChI: InChI=1S/C7H6ClNOS/c8-6-3-1-5(2-4-6)7(9)11-10/h1-4H,9H2
charge 0 multiplicity 1
17 atoms
Cl 4.367175 -0.320671 -0.07084
S  -2.845648 -1.045614 -0.187023
O  -4.303934 -0.154324 0.018371
N  -2.371848 1.45483 0.342295
C  -0.248773 0.156164 0.063875
C  0.593764 1.279834 -0.188729
C  0.358856 -1.117175 0.272824
C  1.995269 1.139731 -0.231207
C  1.75745 -1.269345 0.224209
C  -1.7028 0.306548 0.113262
C  2.560047 -0.135184 -0.023505
H  0.156959 2.264259 -0.39084
H  -0.266377 -1.988863 0.496237
H  2.637382 2.001902 -0.431664
H  2.218494 -2.247155 0.388875
H  -1.923922 2.32788 0.613598
H  -3.426891 1.304882 0.303661
