program: Gaussian 09
title: 000017375
version: EM64L-G09RevD.01
frameworkgroup: C1[X(C20H16O2)]
method: RPBEPBE
basis: SDD
operation: Freq
keyword: #pfreq=noraman
keyword: PBEPBE/SDD
title: #p freq=noraman PBEPBE/SDD
converged: YES YES NO NO
title: Mulliken charges:
elementType: O O C C C C C C C C C C C C C C C C C C C C H H H H H H H H H H H H H H H H
charge: -0.451651 -0.441300 0.133818 0.284201 0.127874 0.089464 0.223356 0.267862 0.100631 0.424644 -0.406368 -0.643118 -0.572373 -0.516618 -0.385978 -0.399561 -0.383548 -0.455269 -0.270708 -0.270142 -0.269346 -0.251535 0.267736 0.256382 0.231651 0.214740 0.207253 0.234145 0.270595 0.226752 0.320733 0.240852 0.227396 0.227216 0.227087 0.228297 0.343022 0.341809
chargesum: 0.00000
title: Mulliken charges with hydrogens summed into heavy atoms:
elementType: O O C C C C C C C C C C C C C C C C C C C C
charge: -0.108629 -0.099492 0.133818 0.284201 0.127874 0.089464 0.223356 0.267862 0.100631 0.424644 -0.138632 -0.155085 -0.150379 -0.282473 -0.115383 -0.172809 -0.062816 -0.214417 -0.043312 -0.042926 -0.042259 -0.023238
polarizability: 4.03038825e+02 1.29270178e+01 2.63126776e+02 5.14490905e+00 -2.18720590e+00 1.01037173e+02
1716.lowfreq: -3.2299 0.0005 0.0005 0.0006 4.7911 7.8071 33.2188 48.4327 62.8211
frequency: 33.1694 48.4279 62.8199 97.8006 113.8820 135.9171 139.5571 185.5911 193.5687 243.5669 256.0436 263.5898 290.1897 312.8867 330.7304 349.5648 375.3381 384.1118 392.5721 426.8952 444.5018 455.0343 513.9690 522.4755 534.8726 538.0548 570.1397 596.1400 616.9809 623.8668 653.3227 674.3715 709.6229 729.7500 768.5334 771.2292 772.2893 789.2607 817.6537 822.8020 849.5718 879.0183 894.2992 897.7543 919.1360 932.3573 951.2649 958.5823 968.5465 981.8128 986.8484 994.3484 1020.6172 1023.8175 1046.0575 1052.9927 1062.6733 1073.3196 1109.7555 1149.4333 1172.9310 1182.2669 1183.1609 1194.4282 1196.1483 1201.5510 1218.7990 1237.3467 1248.6004 1287.0703 1300.0921 1323.8489 1358.4328 1371.4111 1385.2725 1397.7547 1403.6182 1406.1663 1420.8692 1432.4880 1442.8129 1459.6014 1486.0599 1505.0204 1508.4996 1522.5184 1547.0681 1567.0593 1572.4230 1613.1100 1616.8233 1630.5134 2971.7282 2976.2209 3022.2963 3028.9807 3117.2210 3122.6568 3126.5879 3128.6460 3137.2043 3144.4929 3158.1493 3161.6005 3169.2796 3170.9472 3532.7846 3535.3610
redmass: 5.7471 5.2390 4.8882 4.2156 4.2691 4.9750 6.2870 4.6890 5.1504 4.7583 4.9097 1.1396 4.6857 1.1028 4.8858 3.2716 3.4268 4.1442 3.2032 3.5927 3.9375 4.1973 3.6058 6.1022 3.9674 4.0967 4.0211 4.2124 4.7167 5.0602 5.5868 4.0319 3.1960 3.4085 1.3534 1.7764 3.6490 2.9353 3.2816 1.9762 1.8122 4.1158 4.7557 1.5914 3.5659 4.4100 3.1802 1.5272 1.5978 1.4160 1.3581 2.3577 1.9470 2.1129 2.4336 1.9388 1.8969 2.7267 2.2525 1.5542 1.2358 1.1207 1.1365 1.1897 1.3080 1.1572 1.1339 1.9433 1.5186 1.8078 2.1453 2.2760 3.7902 2.4642 3.5178 3.8371 1.5278 1.4943 2.3266 3.0230 4.4123 2.2841 2.1951 2.4599 1.1758 1.3398 5.9174 6.9065 8.0665 5.8525 6.1027 6.4208 1.0617 1.0581 1.0995 1.1042 1.0871 1.0903 1.0885 1.0853 1.0941 1.0892 1.1004 1.0940 1.0953 1.0989 1.0663 1.0662
irintensity: 1.4349 0.2965 1.2403 2.9955 1.7497 6.0444 1.1915 2.3845 1.2614 2.2744 8.7708 110.9870 6.6723 107.1513 7.0162 1.8695 3.8330 4.1362 0.8647 2.9845 1.3302 3.7340 1.8027 1.7163 5.6734 10.8903 8.3870 4.5623 4.6329 0.7036 1.7037 11.6081 12.6888 49.6188 66.4116 20.2654 8.5092 2.1792 20.2069 42.1701 14.7923 1.6145 2.4920 1.9233 26.7180 95.7858 3.8560 13.6943 3.0884 2.9073 0.1740 13.3472 14.8614 3.5223 6.6795 4.0161 2.5966 3.7081 6.1247 16.2619 48.9775 4.5700 5.1037 13.9529 21.6445 1.4512 2.2830 4.0947 2.0239 5.2146 0.6614 5.6637 1.2841 1.1788 4.6439 1.6470 6.8262 6.6372 12.7751 3.0407 1.6306 6.6188 3.7071 20.4589 24.3792 10.2652 1.3697 0.2494 0.2707 2.0830 0.2739 0.2852 66.7962 45.1257 34.7268 22.4626 3.3537 13.0306 14.1564 2.5804 8.1703 11.9233 55.9162 25.8110 26.5885 28.1661 4.8547 2.4100
temp: 298.150 k
press: 1.00000 atm
elementType: 8 8 6 6 6 6 6 6 6 6 6 6 6 6 6 6 6 6 6 6 6 6 1 1 1 1 1 1 1 1 1 1 1 1 1 1 1 1
symmnumber: 1
zpe: 790798.7 jmol-1
zpe.correction: 0.301199 hartree
zpe.thermalcorrener: 0.318804 hartree
zpe.thermalcorrenthalpy: 0.319748 hartree
zpe.thermalcorrgfe: 0.255975 hartree
zpe.sumelectzpe: -920.656445 hartree
zpe.sumelectthermal: -920.638841 hartree
zpe.sumelectthermalent: -920.637897 hartree
zpe.sumelectthermalfe: -920.701670 hartree
dipole: -0.2950 0.1983 0.0890
dipole: 0.3664
quadrupole: -109.2069 -99.6297 -136.2494
quadrupole: -5.6981 4.7043 -11.0246
quadrupole: 5.8218 15.3989 -21.2207 -5.6981 4.7043 -11.0246
hfenergy: -920.9576448 hartree
pointgroup: C01 [X(C20H16O2)]
dipole: -0.1120655 -0.0833984 -0.0355852 debye
polarizability: 403.9753028|-6.0001105|262.2208043|-4.8163824|-1.5310743|101.0066666 unknown
InChI: InChI=1S/C20H16O2/c21-11-18-15-7-3-4-8-16(15)19(12-22)20-14-6-2-1-5-13(14)9-10-17(18)20/h1-10,21-22H,11-12H2
charge 0 multiplicity 1
38 atoms
O  0.254007 3.517809 0.256365
O  -2.083297 -3.555282 -0.79425
C  0.546407 0.087197 -0.038997
C  -0.013567 -1.254314 0.087051
C  -0.346453 1.176174 -0.248773
C  -1.412499 -1.454939 0.248312
C  -1.761857 0.987192 -0.07905
C  -2.304451 -0.334854 0.190839
C  2.015139 0.234212 0.036458
C  2.850566 -0.932609 -0.099566
C  0.878095 -2.396647 -0.038703
C  0.122846 2.498655 -0.822867
C  -1.934484 -2.852921 0.506693
C  2.236906 -2.241362 -0.189601
C  -2.669729 2.102875 -0.15141
C  -3.732037 -0.470679 0.331894
C  2.658925 1.476514 0.333304
C  4.270175 -0.804408 -0.074053
C  -4.04286 1.934526 0.007909
C  -4.581625 0.628526 0.237924
C  4.060769 1.579103 0.376904
C  4.877641 0.441352 0.141339
H  0.438967 -3.395978 -0.091095
H  1.092555 2.365985 -1.337893
H  -0.616998 2.851418 -1.568262
H  -1.228364 -3.407951 1.156845
H  -2.905412 -2.816862 1.034653
H  2.884901 -3.113512 -0.336867
H  -2.262611 3.110035 -0.27407
H  -4.168436 -1.460083 0.493361
H  2.052709 2.349148 0.600031
H  4.882938 -1.705419 -0.198056
H  -4.71265 2.800578 -0.03112
H  -5.664167 0.496838 0.343168
H  4.52396 2.542332 0.61893
H  5.969311 0.529991 0.166217
H  0.488963 4.387495 -0.160261
H  -2.466784 -4.455236 -0.625003
