program: Gaussian 09
title: 000188184
version: EM64L-G09RevD.01
frameworkgroup: C1[X(C19H13F3O9)]
method: RPBEPBE
basis: SDD
operation: Freq
keyword: #p
keyword: freq=noraman
keyword: PBEPBE/SDD
title: #p freq=noraman PBEPBE/SDD
converged: YES YES NO NO
title: Mulliken charges:
elementType: F F F O O O O O O O O O C C C C C C C C C C C C C C C C C C C H H H H H H H H H H H H H
charge: -0.152334 -0.147767 -0.130480 -0.156444 -0.219342 -0.442312 -0.254402 -0.283928 -0.265479 -0.166924 -0.141249 -0.160223 -0.326613 -0.101630 -0.157510 0.076079 -0.035387 0.283032 0.089209 0.144337 0.276093 -0.543249 0.195298 -0.485117 -0.084874 -0.526142 -0.002621 0.077133 0.272811 -0.530759 0.322222 0.310316 0.269615 0.280516 0.312297 0.273514 0.370104 0.263286 0.260834 0.255646 0.256523 0.240997 0.251890 0.233037
chargesum: 0.00000
title: Mulliken charges with hydrogens summed into heavy atoms:
elementType: F F F O O O O O O O O O C C C C C C C C C C C C C C C C C C C
charge: -0.152334 -0.147767 -0.130480 -0.156444 -0.219342 -0.072208 -0.254402 -0.283928 -0.265479 -0.166924 -0.141249 -0.160223 -0.016297 0.167985 0.123006 0.076079 0.276910 0.283032 0.089209 0.144337 0.276093 -0.269735 0.195298 0.039002 -0.084874 -0.013973 -0.002621 0.077133 0.272811 0.195166 0.322222
polarizability: 3.12555494e+02 4.84647777e+00 2.58785008e+02 -5.51246298e+01 2.89367484e+01 1.80228652e+02
1716.lowfreq: -9.0993 -3.6776 0.0002 0.0006 0.0009 6.5933 12.3698 17.7073 21.7716
frequency: 12.3263 17.6678 21.7386 34.8985 43.4580 56.1353 58.2594 72.2308 85.4780 93.9234 116.1928 126.1388 139.3470 156.9070 188.0969 199.4248 203.9584 217.2915 224.1795 238.0618 239.0253 261.3466 283.6300 290.3758 294.2383 315.1560 325.7509 328.5212 365.7023 367.4275 392.2061 404.5702 436.0807 447.4685 465.7053 480.5378 494.8831 520.2846 528.2855 534.5813 549.3536 569.3690 602.9498 608.1099 624.3045 642.5631 661.7717 667.8805 680.4342 703.4048 718.4687 723.1814 742.0626 759.8710 767.3791 780.5656 805.8534 809.3640 830.7112 838.0935 844.1450 871.8976 880.0808 900.3706 921.7490 933.0806 967.1973 990.5486 998.7720 1005.1393 1012.3320 1021.8094 1038.9735 1041.2643 1041.9467 1064.0105 1079.2425 1096.5501 1113.7577 1129.4766 1139.2772 1159.5879 1173.4828 1193.4213 1198.0278 1198.6022 1212.5729 1229.1217 1244.4308 1250.9292 1265.7489 1274.2272 1283.2446 1289.0691 1296.3999 1312.1576 1324.6665 1350.6828 1391.3298 1398.5359 1426.2544 1439.9308 1442.5576 1465.4299 1471.2018 1477.3840 1483.1236 1544.2863 1602.4487 1625.7638 1630.8507 1679.1609 1735.6061 2978.4409 3014.4401 3024.9568 3055.8060 3056.7021 3059.7979 3075.6388 3081.1319 3131.7546 3138.8605 3140.3287 3202.9694 3580.5749
redmass: 10.7560 17.4561 8.0916 6.1349 13.1189 5.8883 8.0928 7.4775 8.0525 2.9855 7.8895 4.6112 3.3676 5.0348 4.2867 7.0306 3.5386 6.0388 6.5712 8.6921 10.1101 1.9796 2.7406 2.8550 2.5945 4.9040 4.7755 5.1274 7.6633 8.7039 7.7416 7.4808 8.9682 14.4841 8.4507 10.2903 8.6450 7.8810 4.7582 5.9917 2.6691 9.2503 7.3906 3.9485 7.6723 13.0844 8.4021 7.9359 8.2451 12.6674 4.3235 6.5613 7.5780 6.6199 4.1216 9.5271 5.5645 6.8990 1.8262 2.6800 3.4717 5.4733 5.1457 6.6826 3.6337 2.8576 4.8069 2.2046 4.4599 4.1990 10.2272 4.7819 5.1073 5.0256 4.7037 3.3584 9.4877 8.2842 1.2566 2.7238 1.2156 1.4391 1.4732 1.3213 1.1333 1.4837 2.6200 1.8885 1.6924 1.6524 1.9153 3.6118 1.9936 1.5442 1.9101 1.6748 1.3060 4.0952 6.4691 1.6269 1.1993 1.2451 1.2373 1.6001 1.0553 2.8078 2.2354 7.8302 10.6421 10.1182 12.2085 12.7977 12.8211 1.0319 1.0601 1.0635 1.0870 1.0868 1.1008 1.1050 1.1009 1.0894 1.1013 1.0923 1.0921 1.0668
irintensity: 0.4779 0.1480 3.5997 0.6102 1.5743 0.0360 2.3089 1.2376 2.3621 2.7954 1.3472 0.7306 3.8425 0.6176 1.5720 2.2459 1.1765 0.3377 0.3161 0.4883 0.1588 0.8811 47.1511 31.9542 31.2451 51.3076 1.4516 7.4996 6.3784 4.2267 2.1825 11.9477 13.2242 4.1819 3.9685 7.0253 10.4420 21.1890 3.1135 11.0284 8.5251 22.4472 2.6143 5.3868 39.0925 5.8778 22.7467 12.0845 8.4056 17.3044 1.9560 6.7161 14.1155 161.0374 56.0697 44.5686 65.9405 26.6482 1.4348 14.0030 112.2654 17.1658 97.3015 189.1777 36.3568 64.0417 36.4521 0.2200 139.1022 4.6050 201.0945 66.0809 19.8873 171.2706 59.8335 118.7760 381.0036 104.5612 0.0075 30.8403 0.2782 32.1422 54.2692 72.3777 3.9146 53.9476 46.6045 53.5877 10.4008 28.8691 31.6862 28.2435 94.2158 9.3855 43.7543 4.4387 3.3671 152.3618 64.4707 8.1118 12.9666 61.2774 18.5474 75.9619 15.2169 183.1214 87.0535 178.9889 321.0943 551.8304 0.5159 270.2498 543.1746 53.5265 12.8563 2.4657 11.4218 2.4213 0.5236 27.9583 9.7216 3.2259 13.6872 12.7960 0.3271 29.3644
temp: 298.150 k
press: 1.00000 atm
elementType: 9 9 9 8 8 8 8 8 8 8 8 8 6 6 6 6 6 6 6 6 6 6 6 6 6 6 6 6 6 6 6 1 1 1 1 1 1 1 1 1 1 1 1 1
symmnumber: 1
zpe: 776797.8 jmol-1
zpe.correction: 0.295867 hartree
zpe.thermalcorrener: 0.323067 hartree
zpe.thermalcorrenthalpy: 0.324011 hartree
zpe.thermalcorrgfe: 0.235148 hartree
zpe.sumelectzpe: -1706.103500 hartree
zpe.sumelectthermal: -1706.076299 hartree
zpe.sumelectthermalent: -1706.075355 hartree
zpe.sumelectthermalfe: -1706.164219 hartree
dipole: -0.0430 5.0632 5.5112
dipole: 7.4841
quadrupole: -219.3502 -163.5192 -174.1851
quadrupole: 32.1154 13.5037 -0.2054
quadrupole: -33.6654 22.1656 11.4998 32.1154 13.5037 -0.2054
hfenergy: -1706.3993662 hartree
pointgroup: C01 [X(C19H13F3O9)]
dipole: 0.0188872 -1.9491145 -2.2069178 debye
polarizability: 312.0375882|-5.4674937|257.4870038|55.4290624|31.0668327|182.0445616 unknown
InChI: InChI=1S/C19H13F3O9/c1-27-7-4-8-11(14-10(7)5-2-3-6(23)9(5)15(25)29-14)12-13(24)17(30-16(12)28-8)31-18(26)19(20,21)22/h4,12-13,16-17,24H,2-3H2,1H3
charge 0 multiplicity 1
44 atoms
F  -2.442055 -2.529359 0.547897
F  -2.079751 -1.713065 2.638997
F  -4.023796 -2.776774 2.154251
O  -3.596631 1.388662 -1.214809
O  -2.059454 0.009222 -2.501241
O  -2.279323 3.818278 0.095304
O  -2.711244 0.261576 0.724066
O  1.453878 1.907354 -0.023417
O  1.861543 -2.757424 -1.39345
O  5.555816 1.207588 1.844853
O  3.068625 3.017333 1.207929
O  -4.911839 -0.277515 1.36191
C  -1.247439 2.031326 -1.340664
C  -2.453275 1.407947 -2.123847
C  -1.845546 2.42652 0.0527
C  -0.273112 0.88105 -1.281445
C  -3.131347 1.587631 0.131378
C  -0.80724 -0.244439 -1.928368
C  0.978697 0.773161 -0.669198
C  1.719854 -0.460424 -0.707984
C  2.998534 -0.463507 -0.04793
C  -0.152625 -1.485723 -2.007475
C  1.113705 -1.582312 -1.390579
C  3.98355 -1.618026 0.066707
C  3.491298 0.677815 0.599036
C  5.176993 -1.055891 0.875001
C  4.828978 0.412918 1.198004
C  2.780785 1.940578 0.675592
C  -3.710262 -0.544357 1.231503
C  1.280292 -3.9473 -2.035601
C  -3.065153 -1.897146 1.647308
H  -0.839544 2.928127 -1.834646
H  -2.794954 1.890488 -3.04769
H  -1.149008 2.185066 0.87426
H  -3.950984 2.017415 0.723857
H  -0.629695 -2.325573 -2.51318
H  -1.495272 4.400441 0.257571
H  3.499012 -2.481987 0.554647
H  4.270018 -1.974278 -0.938517
H  6.127645 -1.085383 0.313536
H  5.348546 -1.600168 1.820636
H  0.333323 -4.235518 -1.543401
H  2.031482 -4.737834 -1.898654
H  1.111471 -3.770093 -3.113945
