program: Gaussian 09
title: 000188172
version: EM64L-G09RevD.01
frameworkgroup: C1[X(C22H20O2)]
method: RPBEPBE
basis: SDD
operation: Freq
keyword: #pfreq=noraman
keyword: PBEPBE/SDD
title: #p freq=noraman PBEPBE/SDD
converged: YES YES NO NO
title: Mulliken charges:
elementType: O O C C C C C C C C C C C C C C C C C C C C C C H H H H H H H H H H H H H H H H H H H H
charge: -0.213313 -0.274730 0.139571 -0.521388 -0.457832 0.110436 -0.532868 0.172155 0.319119 -0.361729 -0.460015 -0.056637 -0.814493 0.249811 0.252068 0.171907 -0.401947 -0.407885 -0.407890 -0.236275 0.166115 -0.252372 -0.408708 -0.532383 0.244881 0.246659 0.220845 0.217782 0.219746 0.229558 0.261706 0.233732 0.232455 0.230425 0.230975 0.263978 0.260927 0.276327 0.231347 0.224222 0.242288 0.223872 0.222580 0.244979
chargesum: 0.00000
title: Mulliken charges with hydrogens summed into heavy atoms:
elementType: O O C C C C C C C C C C C C C C C C C C C C C C
charge: -0.213313 -0.274730 0.139571 -0.029848 -0.019205 0.110436 -0.083563 0.172155 0.319119 -0.100024 -0.226284 -0.056637 -0.120639 0.249811 0.252068 0.171907 -0.137970 -0.146958 -0.131563 -0.004928 0.166115 -0.028150 -0.166419 0.159048
polarizability: 3.45274067e+02 -3.51335780e+00 2.49077911e+02 1.90408635e+01 -1.20981543e+01 1.74590565e+02
1716.lowfreq: -9.2654 -5.0771 -0.0007 -0.0004 0.0006 6.7882 25.3481 31.4266 33.4847
frequency: 25.3149 31.4009 33.4720 72.7230 95.4281 102.1099 121.5534 134.8469 141.2970 151.0319 167.9854 181.4067 194.7226 220.4381 240.3175 254.5422 262.1711 285.4127 293.9513 322.4263 343.2261 390.2831 455.2458 468.6211 476.4930 484.9321 498.8821 515.2274 528.3615 535.9781 554.1254 579.0438 600.1366 607.6649 633.7472 661.9143 675.1824 717.4038 740.2876 755.1358 772.6651 782.9309 796.4728 829.3011 833.9558 841.3664 842.1195 851.8265 872.1004 882.8107 918.3652 932.5248 940.0797 965.1114 967.6104 976.3159 995.3614 1012.3033 1022.6172 1026.5561 1048.5224 1057.4085 1078.8406 1083.6251 1113.0890 1128.5528 1139.8641 1155.1099 1167.3542 1177.0868 1182.6578 1194.0913 1200.4918 1205.7121 1222.4560 1238.1500 1247.5823 1262.2048 1279.9193 1284.9262 1286.7425 1317.7329 1364.1759 1386.1368 1395.0548 1398.6269 1402.2893 1410.0148 1422.2524 1437.7013 1450.5702 1455.5519 1461.2302 1465.8962 1466.7585 1470.2318 1473.7316 1478.9387 1480.3307 1517.4690 1526.0674 1581.7210 1583.5834 1590.5024 1605.4424 1623.8183 2961.9203 2964.0570 2972.0171 2995.3848 3001.5885 3034.6241 3046.6562 3051.0469 3062.2549 3077.2683 3085.8722 3125.1822 3126.1160 3135.7721 3137.7835 3156.4223 3157.5861 3165.8643 3175.7968 3177.3321
redmass: 4.8139 4.2298 4.6464 4.4034 1.9343 1.5241 3.7651 3.9894 2.2901 2.5469 4.4602 3.1592 3.9127 2.2648 2.0181 2.3909 2.5963 3.2249 4.1488 5.6440 5.1537 5.8325 4.9243 3.4579 5.4909 4.6282 3.0669 3.7557 4.4570 5.5828 4.2614 3.5541 5.4631 3.8501 4.1756 3.4162 3.2521 3.7022 1.4221 4.7472 3.8673 5.2682 1.4324 1.6889 3.0215 2.3572 3.5919 3.1847 1.4705 1.9296 2.6245 2.4131 1.4746 1.3444 1.3455 3.5988 1.3549 3.2571 2.1907 1.6028 1.7391 2.3925 2.4303 1.9397 1.2604 1.2556 2.5598 1.3474 1.4470 1.4242 2.1011 1.2936 1.6487 1.3343 1.7597 2.5543 1.9359 2.1421 1.4727 2.0416 1.9345 1.5578 3.5452 3.3189 1.5773 2.7227 3.7224 2.5508 4.1456 1.3835 1.1044 2.0972 1.0883 1.0502 1.0692 1.1838 1.0778 1.1424 2.5146 4.3293 9.2900 7.3265 6.3149 6.5619 7.2653 6.9646 1.0327 1.0658 1.0375 1.0675 1.0655 1.0931 1.0967 1.1040 1.0942 1.1027 1.0985 1.0882 1.0997 1.0872 1.0869 1.0949 1.0933 1.0910 1.0972 1.0969
irintensity: 1.1215 0.5064 0.3820 0.4358 3.4387 6.0928 3.4370 1.4425 1.1941 1.2008 3.4528 0.6109 0.1060 0.3782 1.2696 6.1979 1.1098 1.6261 2.7966 4.0773 1.2168 2.2032 3.6844 1.2446 8.7178 1.9551 0.8237 3.1368 4.8831 0.0746 0.8822 8.7046 5.0249 2.7449 12.6862 18.9491 1.3094 0.4439 5.5812 48.4648 11.6280 6.2570 115.1791 18.7829 9.0955 3.3957 4.3278 5.4084 1.5149 10.2320 6.0911 0.7999 1.3321 2.0551 0.1744 57.1699 2.0120 25.2638 0.7163 3.0205 7.4755 12.2014 5.5658 27.8250 0.1346 2.2307 59.3641 10.5813 2.4896 4.1941 5.9733 8.7131 12.7910 2.1051 35.6446 216.8929 44.4367 18.2045 73.4037 92.4858 60.9255 4.8139 11.3455 10.7331 8.4429 10.6095 30.1360 15.7413 14.1507 10.8719 11.8259 75.1292 9.8022 13.6187 6.6729 7.3506 26.9027 8.3717 13.9003 10.9029 168.2818 39.2566 91.2396 17.8114 53.1416 8.2287 80.7229 40.3505 29.1140 11.4463 39.2299 40.5554 14.8865 44.2347 14.4367 48.9789 20.9135 13.6921 23.4927 8.0659 8.0763 11.9066 7.7430 15.1635 18.7415 7.9040
temp: 298.150 k
press: 1.00000 atm
elementType: 8 8 6 6 6 6 6 6 6 6 6 6 6 6 6 6 6 6 6 6 6 6 6 6 1 1 1 1 1 1 1 1 1 1 1 1 1 1 1 1 1 1 1 1
symmnumber: 1
zpe: 931577.5 jmol-1
zpe.correction: 0.354819 hartree
zpe.thermalcorrener: 0.375759 hartree
zpe.thermalcorrenthalpy: 0.376703 hartree
zpe.thermalcorrgfe: 0.304440 hartree
zpe.sumelectzpe: -999.118842 hartree
zpe.sumelectthermal: -999.097902 hartree
zpe.sumelectthermalent: -999.096958 hartree
zpe.sumelectthermalfe: -999.169221 hartree
dipole: -0.7720 -4.6016 -0.3521
dipole: 4.6792
quadrupole: -107.3635 -137.6082 -138.2264
quadrupole: 3.2716 -1.1517 -6.2143
quadrupole: 20.3692 -9.8755 -10.4937 3.2716 -1.1517 -6.2143
hfenergy: -999.4736609 hartree
pointgroup: C01 [X(C22H20O2)]
dipole: 0.2810825 -1.6349725 -0.7980654 debye
polarizability: 341.8930347|-14.0489111|219.4738544|27.3023313|37.0508375|207.5756542 unknown
InChI: InChI=1S/C22H20O2/c1-14-12-13-20(16-7-3-6-15(14)16)22(23)19-10-4-9-18-17(19)8-5-11-21(18)24-2/h4-5,8-13H,3,6-7H2,1-2H3
charge 0 multiplicity 1
44 atoms
O  -1.082851 2.548948 1.031605
O  5.12849 -0.917396 0.112704
C  -2.939259 0.572415 -0.032792
C  -3.503556 1.920312 -0.459191
C  -4.699883 1.538022 -1.3828
C  -3.882421 -0.455103 -0.285524
C  -5.148594 0.121893 -0.906979
C  -1.677144 0.264769 0.549148
C  -3.620196 -1.805854 0.053761
C  -1.406421 -1.095907 0.875809
C  -2.359979 -2.104396 0.63985
C  -0.696473 1.344132 0.881119
C  -4.647049 -2.893218 -0.19694
C  0.7590 1.010781 1.129953
C  1.586555 0.261216 0.208738
C  2.968369 0.015664 0.575237
C  1.316489 1.523331 2.313273
C  1.11888 -0.200551 -1.069679
C  3.484429 0.513694 1.812379
C  2.671544 1.266496 2.664142
C  3.814464 -0.71961 -0.337653
C  1.971112 -0.896049 -1.925663
C  3.326077 -1.17277 -1.568089
C  6.047001 -1.640634 -0.768824
H  -3.839446 2.479039 0.436042
H  -2.755667 2.56835 -0.946381
H  -5.517578 2.278346 -1.344964
H  -4.351228 1.477886 -2.431134
H  -5.549782 -0.498213 -1.729885
H  -5.95118 0.194465 -0.143387
H  -0.444774 -1.355205 1.329784
H  -2.128886 -3.140801 0.912715
H  -5.589628 -2.687894 0.345858
H  -4.907492 -2.960914 -1.270694
H  -4.276759 -3.880687 0.126389
H  0.681366 2.124625 2.971972
H  0.089852 0.002155 -1.375654
H  4.527357 0.304491 2.064837
H  3.071771 1.659714 3.604542
H  1.601817 -1.239946 -2.898039
H  3.962142 -1.72518 -2.265188
H  6.179832 -1.109643 -1.731267
H  5.691199 -2.671769 -0.959289
H  7.002498 -1.671005 -0.225143
