program: Gaussian 09
title: 000196390
version: EM64L-G09RevD.01
frameworkgroup: C1[X(C10H19NO2S2)]
method: RPBEPBE
basis: SDD
operation: Freq
keyword: #p
keyword: freq=noraman
keyword: PBEPBE/SDD
title: #p freq=noraman PBEPBE/SDD
converged: YES YES NO NO
title: Mulliken charges:
elementType: S S O O N C C C C C C C C C C H H H H H H H H H H H H H H H H H H H
charge: -0.054856 0.020042 -0.174778 -0.264444 -0.619867 -0.381679 -0.462289 -0.346084 -0.374036 -0.370114 -0.522250 -0.289165 0.229365 -0.132884 -0.675757 0.200042 0.224870 0.297111 0.190225 0.218023 0.233762 0.219100 0.204880 0.234873 0.212412 0.239067 0.224902 0.221948 0.105946 0.313262 0.333088 0.274777 0.234864 0.235644
chargesum: 0.00000
title: Mulliken charges with hydrogens summed into heavy atoms:
elementType: S S O O N C C C C C C C C C C
charge: 0.051091 0.020042 -0.174778 -0.264444 0.026482 0.043233 -0.165177 0.062164 0.078825 0.069639 -0.070771 0.157684 0.229365 -0.132884 0.069527
polarizability: 1.68756490e+02 1.26466766e+01 1.52329188e+02 7.90319969e+00 -8.80930286e-01 1.44775436e+02
1716.lowfreq: -9.6530 -0.0018 -0.0012 -0.0012 5.3271 5.7799 12.3201 17.7316 22.9816
frequency: 11.5876 17.6804 22.2078 31.8394 44.8442 54.5085 73.5544 98.7403 114.3646 122.8035 145.9745 162.4724 182.2044 190.1478 207.3338 249.8548 290.3136 297.7878 371.0163 380.6615 420.7047 447.9397 458.2934 473.7162 480.4293 500.1442 526.3806 596.1478 640.4321 668.6130 703.9798 732.9585 780.3564 804.5547 824.4952 849.4506 862.8826 905.3232 945.0802 967.8591 993.2068 1009.8037 1033.2014 1044.9180 1048.6771 1073.2298 1083.8689 1105.5767 1113.5219 1135.7999 1188.1314 1192.6303 1198.9735 1223.8789 1233.0840 1238.9708 1261.1389 1282.7145 1286.1291 1294.0854 1319.1034 1344.1743 1350.7170 1358.2497 1360.7008 1371.2938 1380.2025 1443.3231 1444.0724 1449.1559 1454.0448 1466.1756 1469.5613 1469.8842 1484.3557 1595.6983 1642.6263 2437.7229 2958.4230 2967.8037 2971.3057 2973.9157 2986.3184 2989.1896 3001.1239 3003.5277 3020.3779 3031.3697 3048.1953 3049.9414 3058.2539 3061.7665 3070.2406 3140.6179 3515.8403 3673.4151
redmass: 9.8689 4.8353 3.5382 3.8456 3.4294 4.7709 3.9249 2.8142 4.0520 2.6573 1.1039 4.3672 2.3638 1.7218 1.8822 3.2357 3.7627 3.1007 2.7214 3.6552 4.1144 2.5212 2.9256 3.9801 3.3313 1.3380 1.7301 1.9121 2.6876 2.0751 3.4552 1.1363 1.3408 2.2047 1.2369 3.2752 2.6581 1.6073 2.0411 2.1181 2.7315 1.5347 2.3286 2.5507 2.1526 1.8671 2.2604 2.3794 1.9961 1.4070 3.4935 1.3328 1.3383 1.3052 2.7200 1.4395 1.3689 1.2014 1.2168 1.1392 1.4150 1.4035 1.5142 1.2929 1.6458 2.2613 1.1978 1.0939 1.0871 1.0821 1.0782 1.0769 1.0615 1.0669 1.0974 1.4356 3.5638 1.0384 1.0592 1.0620 1.0597 1.0406 1.0608 1.0554 1.0629 1.0958 1.0978 1.1023 1.0962 1.0958 1.1012 1.1012 1.1013 1.0962 1.0446 1.1042
irintensity: 0.6449 14.2740 7.0701 2.3981 1.2660 0.8382 2.6948 1.7613 0.4986 3.5300 0.0458 3.3209 3.3736 12.0965 9.2394 5.6705 6.5573 0.3591 0.5306 3.3288 2.8889 5.0079 3.6156 4.2999 0.6288 91.9018 112.1595 55.6364 6.3306 40.5674 5.7296 14.7528 2.3235 5.7365 6.3316 3.4065 3.1488 7.7334 6.0713 121.5325 28.0305 0.5586 4.2769 4.2955 4.5356 2.9343 2.8185 11.3165 5.9038 0.9419 235.7179 53.6219 96.6242 0.8995 172.8084 32.9134 38.3451 30.2838 5.8142 14.2315 20.7762 13.9025 13.6032 0.6376 3.3002 96.5267 29.8424 12.9283 14.6866 22.4288 1.5483 7.4916 10.5448 11.7663 20.2973 65.2517 281.3098 30.5469 14.1739 16.9642 8.3808 6.5864 44.5266 35.0048 26.9030 4.5392 16.4971 1.9638 2.3869 10.2624 34.4487 75.1511 36.2200 5.3274 27.9013 21.1055
temp: 298.150 k
press: 1.00000 atm
elementType: 16 16 8 8 7 6 6 6 6 6 6 6 6 6 6 1 1 1 1 1 1 1 1 1 1 1 1 1 1 1 1 1 1 1
symmnumber: 1
zpe: 730104.1 jmol-1
zpe.correction: 0.278082 hartree
zpe.thermalcorrener: 0.297510 hartree
zpe.thermalcorrenthalpy: 0.298454 hartree
zpe.thermalcorrgfe: 0.224564 hartree
zpe.sumelectzpe: -1392.570817 hartree
zpe.sumelectthermal: -1392.551389 hartree
zpe.sumelectthermalent: -1392.550445 hartree
zpe.sumelectthermalfe: -1392.624335 hartree
dipole: 1.8218 2.0497 1.9180
dipole: 3.3465
quadrupole: -91.0669 -120.2464 -106.5472
quadrupole: 2.2211 -30.6167 -1.5086
quadrupole: 14.8866 -14.2929 -0.5937 2.2211 -30.6167 -1.5086
hfenergy: -1392.8488989 hartree
pointgroup: C01 [X(C10H19N1O2S2)]
dipole: -0.671019 -0.8036507 0.79832 debye
polarizability: 167.4959725|12.8891947|153.2104669|-8.9084065|0.0294983|145.1546744 unknown
InChI: InChI=1S/C10H19NO2S2/c1-8(14)13-7-6-9(15)4-2-3-5-10(11)12/h9,15H,2-7,11H2,1H3
charge 0 multiplicity 1
34 atoms
S  0.639614 -3.496513 -0.606668
S  4.530364 1.889921 -1.868855
O  3.399597 0.166971 -0.216918
O  -4.544554 1.915418 0.775045
N  -6.068119 0.759054 -0.53236
C  -0.162814 -1.079526 0.538484
C  1.095938 -1.700474 -0.102744
C  -1.312835 -0.792394 -0.453092
C  2.322469 -1.72587 0.837993
C  -2.524224 -0.133219 0.240066
C  -3.67282 0.179388 -0.743361
C  2.920437 -0.340635 1.108037
C  -4.778801 1.021565 -0.09123
C  4.051083 1.388405 -0.333417
C  4.291964 2.180031 0.936379
H  0.126005 -0.122386 1.020229
H  -0.522099 -1.740918 1.353812
H  1.352805 -1.169353 -1.035454
H  -0.938007 -0.12563 -1.257491
H  -1.61818 -1.736637 -0.944841
H  3.117147 -2.360732 0.405192
H  2.03322 -2.182717 1.804905
H  -2.900497 -0.794845 1.045756
H  -2.225155 0.813388 0.728643
H  -4.088136 -0.754324 -1.170539
H  -3.269672 0.767714 -1.593411
H  3.776271 -0.412261 1.805028
H  2.175313 0.36717 1.51729
H  1.780874 -3.735081 -1.355862
H  -6.269102 0.033366 -1.217738
H  -6.834645 1.318675 -0.158245
H  4.784914 3.128699 0.686861
H  3.344304 2.400009 1.465444
H  4.938344 1.620541 1.640961
