program: Gaussian 09
title: 000188150
version: EM64L-G09RevD.01
frameworkgroup: C1[X(C26H22O4)]
method: RPBEPBE
basis: SDD
operation: Freq
keyword: #pfreq=noraman
keyword: PBEPBE/SDD
title: #p freq=noraman PBEPBE/SDD
converged: NO YES NO NO
title: Mulliken charges:
elementType: O O O O C C C C C C C C C C C C C C C C C C C C C C C C C C H H H H H H H H H H H H H H H H H H H H H H
charge: -0.272059 -0.257297 -0.283909 -0.232061 0.022442 0.079861 0.321767 0.386715 0.269299 0.220530 0.218496 -0.350112 0.347820 -0.435670 -0.476904 -0.496632 -0.437789 0.168247 0.152927 -0.578456 -0.371296 -0.444912 -0.265721 -0.257061 -0.254118 -0.230104 -0.674198 0.269987 -0.689142 -0.758058 0.230399 0.273841 0.275647 0.265002 0.321394 0.229415 0.279993 0.227541 0.231111 0.219814 0.218591 0.216149 0.216529 0.210850 0.228167 0.228104 0.212051 0.231689 0.231316 0.251158 0.252040 0.256605
chargesum: 0.00000
title: Mulliken charges with hydrogens summed into heavy atoms:
elementType: O O O O C C C C C C C C C C C C C C C C C C C C C C C C C C
charge: -0.272059 -0.257297 -0.283909 -0.232061 0.022442 0.079861 0.321767 0.386715 0.269299 0.220530 0.218496 -0.350112 0.347820 -0.205272 -0.203063 -0.220984 -0.172786 0.168247 0.152927 -0.257062 -0.141880 -0.164919 -0.038180 -0.025950 0.184287 0.202574 -0.007077 0.269987 -0.014085 0.001745
polarizability: 6.08390658e+02 -3.07632280e+01 3.72011391e+02 -5.93848374e+00 -4.51885647e+00 1.37617883e+02
1716.lowfreq: -64.1030 -4.7042 -0.0008 -0.0007 -0.0002 0.8696 4.3444 25.8865 30.2598
frequency: -64.1026 25.8334 30.2361 34.9437 41.8120 61.2861 68.8175 75.8628 91.5731 99.5948 104.7877 110.0888 132.4005 151.3935 198.5902 205.1903 216.5195 223.5303 230.1944 245.2167 251.6132 274.2596 286.2963 289.3866 290.8075 312.3872 314.2335 343.6811 374.7615 411.4829 426.2748 442.5366 473.3752 497.7038 513.5937 516.2800 522.9956 541.4757 558.9743 562.7537 578.3676 609.1071 616.1212 627.0577 644.7418 656.0752 668.3113 698.5593 719.8454 732.9806 739.1758 777.1537 787.2286 799.4471 808.6956 810.2461 824.9491 830.2683 851.2144 853.1733 861.4739 868.6690 877.6831 910.2026 928.0650 941.2328 965.0937 977.4985 987.6328 995.2820 997.9946 1001.3926 1016.6085 1024.8275 1034.7917 1043.9017 1053.4614 1072.8394 1094.6452 1109.9406 1115.4947 1130.9326 1132.6098 1134.8791 1159.7977 1163.7654 1170.5092 1179.0600 1191.1183 1214.8741 1248.9587 1252.3736 1266.4981 1272.1294 1283.9845 1314.4004 1332.3907 1361.7696 1370.0527 1375.9299 1383.1021 1386.2162 1396.3955 1400.6706 1401.2890 1405.5502 1413.7037 1426.7346 1442.2694 1454.3206 1457.5072 1458.0349 1462.3623 1467.9740 1471.5134 1476.9048 1478.1095 1486.4631 1492.5310 1506.2561 1513.3492 1553.8097 1581.3712 1585.7659 1600.7863 1616.6906 1629.7621 1642.6736 2962.9520 2966.9887 2994.5848 2997.3873 3007.9590 3018.1648 3027.3295 3091.9069 3094.4074 3094.7785 3100.9316 3106.1626 3128.4474 3142.7843 3142.9906 3151.2035 3153.2249 3160.5134 3169.1281 3178.8449 3179.5935 3217.3542
redmass: 1.0479 6.1994 4.4066 3.8457 4.0303 3.0099 2.3584 3.2113 3.8675 3.9808 4.5031 1.7575 5.0040 4.3373 4.6457 4.5723 4.0771 4.2050 1.4422 1.3106 4.2316 5.3184 4.2293 4.5647 4.3625 4.5621 4.8499 4.1823 6.8993 5.1282 5.9465 3.4970 4.6351 5.1912 4.1344 5.2129 4.2946 5.8859 3.4577 6.2034 5.1009 4.4451 6.2721 5.8705 6.1092 5.1687 5.0498 6.1286 3.4049 3.7870 4.5313 1.5426 2.1984 4.8579 1.4969 2.2077 1.1157 3.8013 1.6874 4.5545 2.1323 1.5405 5.2283 1.7944 5.0681 3.8353 1.4159 5.0728 1.3935 1.3290 1.3344 2.0557 2.7330 2.7654 2.2347 1.5911 5.6395 4.2210 3.0310 2.1889 2.1958 1.4552 2.7555 1.4412 1.4831 2.0684 2.2778 1.2611 1.5710 1.6472 1.3139 1.3558 1.1393 3.7166 2.5584 2.5734 2.6042 2.3328 1.4948 1.7502 1.8751 1.3689 1.3985 1.5106 2.9682 5.3630 2.8792 5.5344 4.4235 1.0685 1.0457 1.0410 1.0400 3.5815 3.3629 1.1785 1.0556 1.1585 1.1134 3.4614 3.8386 7.3393 7.9363 8.2550 7.1521 6.3359 7.3876 10.4861 1.0559 1.0557 1.0362 1.0363 1.0368 1.1078 1.1076 1.0989 1.0972 1.0988 1.1012 1.1016 1.0851 1.0890 1.1008 1.0892 1.0871 1.0921 1.0990 1.0962 1.0964 1.0912
irintensity: 1.1945 0.8468 0.2562 2.0656 3.9532 0.4445 1.0924 0.4734 1.7042 0.2250 2.2131 2.3396 0.0492 2.6103 1.5227 0.6282 1.0048 1.0207 0.6368 0.9332 3.1935 5.0129 1.7134 0.5364 0.3532 4.5871 0.8022 2.7183 1.4318 0.2569 0.2144 3.0589 9.5658 26.1777 3.5815 2.1347 1.5661 0.9830 1.7222 1.8739 2.2771 0.3872 2.6502 6.6203 17.3365 2.4762 6.5295 1.3029 0.9413 10.5931 9.3634 97.2629 2.7087 42.6429 1.7723 3.3355 18.0614 25.5142 0.2252 45.3522 16.9812 37.7987 19.7053 10.8704 58.9647 12.0761 0.9226 14.0806 0.0381 0.3824 1.3889 74.2154 44.6742 147.6233 66.6687 10.1690 15.6472 77.8520 161.4744 3.3660 1.6276 9.6862 28.9364 5.2678 62.4788 390.7883 503.1232 46.6213 4.9711 61.7897 7.9189 9.8921 1.6892 481.6002 50.0949 75.6462 22.6852 18.7646 25.5107 20.6897 55.6376 17.5273 48.0569 35.4930 8.7737 6.5951 0.1112 2.1156 33.5858 12.6298 16.6717 11.1436 12.5465 79.5673 9.5895 26.4326 4.9418 26.1468 4.3041 52.6326 49.1838 4.9418 5.7057 1.5093 94.8261 15.0523 9.1703 392.5447 37.7504 43.3473 31.1825 29.4265 6.3614 19.9592 25.8768 30.1658 5.7558 28.9691 29.6022 34.3113 3.2872 10.0348 8.0748 1.4269 3.2318 20.5920 40.3464 27.5912 1.9016 12.5472
temp: 298.150 k
press: 1.00000 atm
elementType: 8 8 8 8 6 6 6 6 6 6 6 6 6 6 6 6 6 6 6 6 6 6 6 6 6 6 6 6 6 6 1 1 1 1 1 1 1 1 1 1 1 1 1 1 1 1 1 1 1 1 1 1
symmnumber: 1
zpe: 1072452.1 jmol-1
zpe.correction: 0.408475 hartree
zpe.thermalcorrener: 0.434240 hartree
zpe.thermalcorrenthalpy: 0.435185 hartree
zpe.thermalcorrgfe: 0.351664 hartree
zpe.sumelectzpe: -1302.813401 hartree
zpe.sumelectthermal: -1302.787636 hartree
zpe.sumelectthermalent: -1302.786691 hartree
zpe.sumelectthermalfe: -1302.870212 hartree
dipole: -0.7440 0.9323 1.5488
dipole: 1.9549
quadrupole: -152.4803 -145.7498 -179.3642
quadrupole: 0.8009 6.2141 2.4738
quadrupole: 6.7178 13.4484 -20.1661 0.8009 6.2141 2.4738
hfenergy: -1303.2218761 hartree
pointgroup: C01 [X(C26H22O4)]
dipole: 0.2893691 -0.3758816 0.6053847 debye
polarizability: 609.866089|-20.466492|368.9972123|20.5415731|12.896699|139.1566319 unknown
InChI: InChI=1S/C26H22O4/c1-4-28-22-14-23(30-15(3)27)20-12-13-21-24-17(10-11-19(22)25(20)24)16-8-6-7-9-18(16)26(21)29-5-2/h6-14H,4-5H2,1-3H3
charge 0 multiplicity 1
52 atoms
O  -3.600318 -2.204821 -0.412025
O  3.445976 2.660586 0.518258
O  3.408677 -2.28019 -0.01666
O  5.68573 -1.696721 0.196871
C  -0.770704 0.253499 -0.021542
C  0.670257 0.230917 0.071638
C  -1.485511 1.496194 0.05911
C  -1.488029 -1.000112 -0.187926
C  1.38846 1.46431 0.250279
C  1.381146 -1.023553 -0.014912
C  -2.936846 1.496554 -0.048795
C  -2.895821 -0.984098 -0.252561
C  -3.640864 0.240627 -0.210213
C  -0.727101 2.706774 0.239942
C  -0.740462 -2.236129 -0.288245
C  0.657006 2.696253 0.332599
C  0.636262 -2.249014 -0.205447
C  2.819088 1.422829 0.342582
C  2.797381 -0.991599 0.082754
C  3.526021 0.207452 0.260054
C  -3.718734 2.696251 -0.002743
C  -5.070071 0.234693 -0.3352
C  -5.112432 2.667078 -0.113387
C  -5.796075 1.424473 -0.286014
C  -3.96917 -2.870592 0.87172
C  4.922264 2.687427 0.618483
C  -4.696679 -4.163277 0.514416
C  4.789703 -2.554615 0.043326
C  5.326214 4.147045 0.801141
C  5.017862 -4.042106 -0.116102
H  -1.247087 3.666055 0.307829
H  -1.30163 -3.158966 -0.460618
H  1.217006 3.624629 0.46952
H  1.193116 -3.185021 -0.291444
H  4.611471 0.165841 0.328031
H  -3.223209 3.663916 0.116755
H  -5.568741 -0.725467 -0.496971
H  -5.682613 3.601761 -0.075896
H  -6.88659 1.411267 -0.388547
H  -3.044942 -3.066414 1.452194
H  -4.613753 -2.185826 1.459369
H  5.239667 2.066832 1.48045
H  5.357572 2.258012 -0.306174
H  -4.993688 -4.701056 1.433288
H  -5.60473 -3.949985 -0.075536
H  -4.045569 -4.824037 -0.083542
H  6.425707 4.224958 0.880395
H  4.993944 4.755386 -0.057213
H  4.879441 4.565197 1.719227
H  5.565716 -4.422042 0.76379
H  5.655616 -4.218989 -0.99987
H  4.070566 -4.587286 -0.228134
