program: Gaussian 09
title: 000188138
version: EM64L-G09RevD.01
frameworkgroup: C1[X(C8H10O4)]
method: RPBEPBE
basis: SDD
operation: Freq
keyword: #pfreq=noraman
keyword: PBEPBE/SDD
title: #p freq=noraman PBEPBE/SDD
converged: YES YES NO NO
title: Mulliken charges:
elementType: O O O O C C C C C C C C H H H H H H H H H H
charge: -0.219286 -0.258876 -0.207134 -0.252646 -0.103698 -0.196540 0.357459 -0.687234 0.128057 -0.651406 0.308552 -0.749811 0.287209 0.264336 0.220745 0.228989 0.252536 0.267373 0.256091 0.256252 0.250412 0.248617
chargesum: 0.00000
title: Mulliken charges with hydrogens summed into heavy atoms:
elementType: O O O O C C C C C C C C
charge: -0.219286 -0.258876 -0.207134 -0.252646 0.160639 0.090670 0.357459 0.015037 0.128057 -0.127942 0.308552 0.005470
polarizability: 1.04512289e+02 -5.57284193e-01 1.02263853e+02 -5.15927392e+00 -8.07641484e+00 8.07361564e+01
1716.lowfreq: -7.6096 -0.0003 0.0007 0.0009 3.7213 11.6622 17.5224 44.2783 70.6834
frequency: 16.9661 44.2479 70.6753 93.3683 111.7069 143.6374 219.0277 240.8014 262.8265 275.8823 302.4215 380.3474 415.6700 501.1304 514.4310 565.1410 584.8530 608.5533 668.7661 697.8475 754.3753 790.0225 837.9626 860.7729 888.2080 943.1748 962.4811 990.9103 1015.9580 1022.3930 1035.8725 1042.4452 1109.0526 1119.1077 1196.9522 1231.2973 1263.4396 1280.6791 1306.6744 1332.1314 1384.0546 1395.6928 1417.0088 1452.0757 1453.0205 1464.2820 1477.2921 1647.4182 1674.9008 1691.2459 2992.0944 3009.5851 3071.7248 3073.7880 3093.7235 3097.5493 3101.3851 3108.4067 3145.8187 3218.6784
redmass: 1.0968 4.5186 6.7302 3.4045 4.7025 3.9340 5.5198 1.1151 4.0018 2.9817 3.9520 3.9159 4.5574 3.4487 3.8042 3.4142 3.4289 6.6133 3.3649 3.1670 4.0128 2.2479 4.8444 3.0694 3.5447 2.3620 2.5421 1.8649 1.5164 1.7794 3.9120 1.6682 1.5165 2.5416 3.3459 2.2450 2.2489 1.2984 1.2845 1.5443 1.2434 1.2199 1.1696 1.0629 1.0466 1.0513 1.0475 9.4014 6.9520 11.7287 1.0366 1.0368 1.0877 1.0909 1.0965 1.0973 1.0621 1.0994 1.1010 1.1159
irintensity: 1.6163 5.0712 3.6901 2.1955 0.8490 4.4808 2.9297 0.9231 1.4291 0.1635 7.9494 4.1149 5.8328 1.9068 0.9886 1.4077 15.9726 9.0302 1.9090 3.4932 2.0601 9.8452 9.4894 28.1569 40.1117 79.1480 69.6614 55.7222 33.8978 82.7410 166.8844 13.3350 28.2270 3.7165 282.1440 49.9031 20.3151 2.8325 0.8430 4.4445 56.0640 20.5995 46.5050 27.6256 19.7608 8.8434 10.6484 137.4332 38.5996 253.6669 11.9907 1.2227 10.5134 1.7809 33.0791 5.7339 0.9321 16.8318 8.1606 0.4943
temp: 298.150 k
press: 1.00000 atm
elementType: 8 8 8 8 6 6 6 6 6 6 6 6 1 1 1 1 1 1 1 1 1 1
symmnumber: 1
zpe: 440656.2 jmol-1
zpe.correction: 0.167837 hartree
zpe.thermalcorrener: 0.180298 hartree
zpe.thermalcorrenthalpy: 0.181242 hartree
zpe.thermalcorrgfe: 0.127264 hartree
zpe.sumelectzpe: -610.827001 hartree
zpe.sumelectthermal: -610.814540 hartree
zpe.sumelectthermalent: -610.813596 hartree
zpe.sumelectthermalfe: -610.867574 hartree
dipole: -3.1855 2.7212 1.3827
dipole: 4.4119
quadrupole: -77.4688 -65.9610 -72.4190
quadrupole: 5.4817 13.6660 -1.9042
quadrupole: -5.5192 5.9886 -0.4694 5.4817 13.6660 -1.9042
hfenergy: -610.9948379 hartree
pointgroup: C01 [X(C8H10O4)]
dipole: 1.555668 -0.6148139 0.4634349 debye
dipolederiv: -0.6257446 0.2918454 -0.0820585 0.465409 -1.1688962 -0.0646784 0.1021777 -0.2882858 -0.4305946 -1.2751797 -0.4306976 -0.0160408 -0.644783 -0.6781478 -0.0837984 -0.1209789 -0.1359336 -0.4767374 -0.9407603 0.318072 -0.2272631 0.3204436 -0.6544169 0.0416715 -0.219452 -0.0001343 -0.440528 -0.6097772 -0.1491871 0.0723049 -0.2174775 -0.3993989 -0.0144835 -0.239559 -0.1761844 -0.8560297 0.4855338 -0.271396 0.0294547 -0.1015144 0.5511956 -0.0642146 0.1299968 -0.2200451 0.306263 0.6125551 0.1141009 -0.1158554 0.1231808 0.3562091 -0.0715147 -0.3116897 -0.1166608 0.2025013 -0.1040307 -0.1701156 -0.1586323 -0.1085409 -0.2964725 -0.1679707 -0.0808512 -0.1445774 -0.2553668 -0.0278836 -0.0355491 0.019708 -0.0420838 -0.1039866 0.0792915 -0.0396225 0.0815456 -0.0155216 1.167612 -0.290885 0.4405726 -0.6297486 1.3605696 0.1798653 0.2018769 0.5539004 0.6744855 -0.0403007 -0.102291 0.0831673 -0.020634 -0.0362241 0.1424902 0.1057728 0.1033351 -0.0873789 1.34116 0.5982721 -0.0817689 0.8200746 0.6107687 0.0790065 0.3801875 0.2770068 1.1075162 -0.2056443 -0.1018952 0.1555875 -0.1187638 -0.0247592 0.0752212 0.2133227 0.1037567 -0.2076406 -0.0212212 0.0419252 -0.0270338 0.0054688 0.0434816 0.0194798 0.0263467 0.096517 -0.0202449 -0.017525 0.0683805 0.0589168 0.040573 0.0320109 0.0027714 0.0713057 -0.0058359 -0.0152824 -0.0639383 0.1037175 -0.062776 0.0767901 0.0249248 0.0404702 -0.0638144 0.0769776 0.0729162 0.0377333 0.0223958 0.0935624 0.0613354 0.0564487 -0.0696942 0.0925646 -0.0281557 -0.0341305 0.0523344 -0.1012393 -0.0496897 -0.0888568 -0.0035408 -0.0508478 -0.0580465 -0.0858025 0.0308423 0.0704063 -0.0043416 -0.0915107 -0.0028124 0.1148655 -0.021326 -0.0714312 -0.0242325 0.1083748 0.0328336 0.096967 -0.0015782 0.0727653 0.093694 -0.0297496 -0.0385995 -0.0181906 0.1388706 0.0495783 0.0586569 -0.0648685 0.0187425 0.0702846 0.0785554 -0.053728 0.0655153 0.0505015 0.0793979 0.0225323 0.0490387 0.0683565 -0.0123888 -0.0698195 0.0361131 -0.0558068 0.099814 0.002861 -0.0792679 -0.0232369 -0.0979244 0.0637786 -0.0307258 -0.0618918 -0.0587092 0.0473698 unknown
polarizability: 104.5261937|-0.1381703|98.1392206|2.1044565|12.6181266|84.846884 unknown
InChI: InChI=1S/C8H10O4/c1-4-7(12-6(3)9)5(2)11-8(4)10/h5,7H,1H2,2-3H3
charge 0 multiplicity 1
22 atoms
O  -1.661168 -0.956314 -1.031324
O  1.290829 0.150016 -0.422444
O  -3.025406 0.90073 -0.663902
O  2.23458 1.107975 1.484826
C  -0.444829 -1.566806 -0.387781
C  0.198933 -0.426701 0.437487
C  -0.927326 0.566296 0.622221
C  -0.883739 -2.767184 0.455008
C  -1.999355 0.258138 -0.383919
C  -1.016505 1.579305 1.518318
C  2.25837 0.917198 0.24813
C  3.283519 1.440405 -0.731054
H  0.651809 -0.761373 1.384653
H  0.214885 -1.864284 -1.218289
H  -0.000552 -3.300562 0.851635
H  -1.515176 -2.450919 1.304518
H  -1.466396 -3.4690 -0.164121
H  -0.214732 1.779673 2.236013
H  -1.902674 2.225575 1.521439
H  2.7893 2.056298 -1.502034
H  3.778703 0.601734 -1.250413
H  4.033232 2.040798 -0.196664
