program: Gaussian 09
title: 000188130
version: EM64L-G09RevD.01
frameworkgroup: C1[X(C15H11F5O)]
method: RPBEPBE
basis: SDD
operation: Freq
keyword: #p
keyword: freq=noraman
keyword: PBEPBE/SDD
title: #p freq=noraman PBEPBE/SDD
converged: YES YES NO NO
title: Mulliken charges:
elementType: F F F F F O C C C C C C C C C C C C C C C H H H H H H H H H H H
charge: -0.143775 -0.162369 -0.143400 -0.143392 -0.141325 -0.261462 -0.432112 0.236037 0.222741 0.322513 0.463803 -0.528181 -0.347072 0.182590 0.098248 -0.457323 -0.788221 0.069515 0.053871 -0.812235 0.121734 0.237862 0.259354 0.236566 0.246384 0.233415 0.238726 0.242330 0.213749 0.228899 0.223507 0.229020
chargesum: 0.00000
title: Mulliken charges with hydrogens summed into heavy atoms:
elementType: F F F F F O C C C C C C C C C C C C C C C
charge: -0.143775 -0.162369 -0.143400 -0.143392 -0.141325 -0.261462 0.065104 0.236037 0.222741 0.322513 0.463803 -0.291615 -0.100688 0.182590 0.098248 -0.223908 -0.093416 0.069515 0.053871 -0.130808 0.121734
polarizability: 1.87331577e+02 7.18044866e-01 1.81276626e+02 5.20104367e+00 -4.86679431e-01 1.28144251e+02
1716.lowfreq: -10.3149 -0.0005 -0.0004 0.0005 0.6223 6.2041 16.0712 22.5878 41.2321
frequency: 15.8867 22.5133 41.2236 44.6897 78.6229 115.1960 118.8091 122.8177 138.8493 156.5347 193.6378 199.7721 222.4396 254.7425 258.7731 268.3897 285.3401 296.4062 308.8498 333.7421 348.1159 372.1023 396.6719 426.1324 437.9508 450.7941 453.1856 498.5658 534.5351 560.2937 569.0137 571.9162 631.4243 650.1058 689.8016 707.7735 721.8501 730.0182 748.1853 804.7498 885.1835 887.0517 911.2072 922.9207 932.8469 967.0650 980.1321 1019.3003 1025.9225 1044.9413 1050.5737 1066.6096 1075.6420 1120.5488 1170.8015 1195.4322 1229.1439 1245.5303 1258.5760 1293.1921 1348.5613 1374.1952 1376.1918 1380.1006 1397.8187 1402.3013 1410.4184 1452.5017 1457.4930 1462.4184 1469.7873 1470.8215 1475.0254 1479.5591 1495.3822 1597.6203 1605.8669 1620.3350 1624.6709 2974.4934 2983.1458 3025.4134 3051.4396 3061.0454 3082.4434 3092.1329 3093.1781 3114.2834 3129.6668 3166.1075
redmass: 6.4523 5.5884 2.6053 1.3593 6.3717 3.6334 1.2068 11.1243 6.7346 11.8556 9.8488 2.8255 6.6097 16.0199 16.5767 2.6989 10.5243 3.2545 13.5685 4.7750 4.5163 12.4716 5.6190 14.4856 2.9519 5.0440 7.0358 4.7192 12.3290 3.1822 5.9562 6.4033 11.9580 6.1666 5.1101 8.0032 3.6299 4.9424 10.1918 1.3623 1.5383 3.6655 8.5229 2.8705 1.4548 8.4328 1.4693 1.5903 2.1537 1.5077 1.5574 9.6640 9.7996 2.8812 1.4994 1.7819 5.8725 1.6649 1.9134 1.5876 1.6969 4.6011 6.0521 4.1626 1.2598 1.3112 2.7171 8.1647 1.0551 4.2863 1.4063 1.0463 1.2781 1.1628 1.9491 6.8616 10.7685 6.2068 11.8881 1.0372 1.0366 1.0601 1.0977 1.0968 1.0985 1.1003 1.1040 1.0913 1.0895 1.0937
irintensity: 0.1512 0.0327 0.1401 0.2906 0.5867 0.1010 0.6242 0.0503 0.8409 0.2706 4.1610 4.7884 0.3859 0.3146 0.1767 0.9754 2.7482 2.3971 5.4440 1.0447 2.2680 0.0378 0.7256 0.1454 7.9049 3.9182 2.9162 1.8251 6.9142 2.7855 16.0595 2.8237 0.1819 10.4655 3.5259 1.6751 0.0409 4.1109 6.1802 57.9458 19.2919 75.9658 62.4709 6.2220 0.8861 70.9992 1.8685 2.1866 49.1101 0.0976 18.3247 15.2245 55.0507 126.5662 5.6438 91.4128 29.0152 4.7895 59.9287 0.4326 20.6539 5.0893 4.8682 17.8427 12.5204 13.7046 2.8084 213.5919 7.6886 100.0825 18.1920 11.5237 27.3697 20.2133 122.3419 0.9830 0.7666 11.6322 25.0930 46.1200 26.6006 27.3449 22.1777 16.6449 18.5224 20.8186 3.4331 23.2321 14.9453 4.9583
temp: 298.150 k
press: 1.00000 atm
elementType: 9 9 9 9 9 8 6 6 6 6 6 6 6 6 6 6 6 6 6 6 6 1 1 1 1 1 1 1 1 1 1 1
symmnumber: 1
zpe: 584599.8 jmol-1
zpe.correction: 0.222662 hartree
zpe.thermalcorrener: 0.242585 hartree
zpe.thermalcorrenthalpy: 0.243529 hartree
zpe.thermalcorrgfe: 0.172128 hartree
zpe.sumelectzpe: -1151.071395 hartree
zpe.sumelectthermal: -1151.051473 hartree
zpe.sumelectthermalent: -1151.050529 hartree
zpe.sumelectthermalfe: -1151.121930 hartree
dipole: -1.3110 -0.1307 1.2976
dipole: 1.8492
quadrupole: -119.6109 -124.2478 -116.6404
quadrupole: 3.1173 10.6354 2.4529
quadrupole: 0.5555 -4.0814 3.5260 3.1173 10.6354 2.4529
hfenergy: -1151.2940578 hartree
pointgroup: C01 [X(C15H11F5O1)]
dipole: -0.4878612 -0.5345125 -0.074677 debye
polarizability: 187.6834529|-1.7081539|130.6092294|-1.2653463|-12.0439487|178.4597719 unknown
InChI: InChI=1S/C15H11F5O/c1-7-3-4-10(8(2)5-7)21-6-9-11(16)13(18)15(20)14(19)12(9)17/h3-5H,6H2,1-2H3
charge 0 multiplicity 1
32 atoms
F  1.763415 -0.49259 1.910907
F  0.522868 -0.986736 -2.748438
F  2.166162 1.142842 -3.409961
F  3.404184 1.639494 1.244238
F  3.611293 2.471067 -1.41471
O  -0.894774 -1.503188 0.934139
C  0.150453 -1.920385 -0.008723
C  -1.98747 -0.729176 0.461452
C  1.07276 -0.772111 -0.395205
C  -2.837856 -0.235122 1.492967
C  -4.272243 0.801093 -0.252479
C  -3.96466 0.52109 1.106885
C  -2.262642 -0.471987 -0.897496
C  1.830626 -0.087564 0.580981
C  1.219949 -0.333012 -1.726355
C  -3.403362 0.292076 -1.243233
C  -2.523297 -0.527181 2.94591
C  2.056101 0.741383 -2.085761
C  2.674275 0.991674 0.257536
C  -5.496972 1.622563 -0.617834
C  2.783461 1.410348 -1.083555
H  -0.281303 -2.388896 -0.910763
H  0.710997 -2.682571 0.55642
H  -4.625217 0.907042 1.894205
H  -1.623069 -0.855359 -1.697568
H  -3.6106 0.488034 -2.301777
H  -2.551844 -1.613636 3.150044
H  -1.503569 -0.191539 3.208974
H  -3.244511 -0.026859 3.61412
H  -5.456356 2.631986 -0.166517
H  -5.58662 1.747735 -1.710656
H  -6.426982 1.143486 -0.257449
