program: Gaussian 09
title: 000188121
version: EM64L-G09RevD.01
frameworkgroup: C1[X(C7H7N5O3)]
method: RPBEPBE
basis: SDD
operation: Freq
keyword: #pfreq=noraman
keyword: PBEPBE/SDD
title: #p freq=noraman PBEPBE/SDD
converged: YES YES NO NO
title: Mulliken charges:
elementType: O O O N N N N N C C C C C C C H H H H H H H
charge: -0.228039 -0.250824 -0.162689 -0.147452 -0.363665 -0.081718 -0.043581 -0.617138 0.190121 0.067894 0.198620 0.008812 -0.212701 0.295692 -0.740183 0.341824 0.269517 0.337005 0.352922 0.253202 0.254518 0.277864
chargesum: 0.00000
title: Mulliken charges with hydrogens summed into heavy atoms:
elementType: O O O N N N N N C C C C C C C
charge: -0.228039 -0.250824 -0.162689 -0.147452 -0.021841 -0.081718 -0.043581 0.072789 0.190121 0.067894 0.198620 0.008812 0.056816 0.295692 0.045402
polarizability: 1.63538040e+02 2.88767648e-01 1.37376452e+02 -1.13280888e+01 1.02654720e+00 6.68241735e+01
1716.lowfreq: -8.0601 -0.0010 -0.0007 -0.0007 0.8152 4.5843 37.1633 58.8086 64.9041
frequency: 37.1385 58.7890 64.9011 91.9784 97.3472 169.2261 200.4902 246.3887 260.9277 273.2074 327.2714 337.5493 356.1253 431.2440 457.9004 496.3646 519.9138 538.4787 561.9846 610.7304 618.9341 657.5660 661.5386 673.2071 694.1966 699.0320 728.7884 753.7897 800.5933 903.8127 956.9744 970.5720 997.9096 1035.9736 1048.8547 1087.2701 1128.9550 1161.1486 1174.7813 1247.7713 1329.5668 1360.7671 1383.8777 1386.2717 1402.8821 1449.6939 1451.2191 1498.3735 1510.0786 1564.6368 1604.2340 1628.4135 1741.9053 3009.3210 3103.1862 3142.3390 3252.7386 3557.7778 3583.8263 3713.3265
redmass: 7.3422 5.7818 4.1075 4.7596 1.1298 8.3619 8.4843 7.9382 4.3821 5.5612 8.0494 4.7918 5.0766 1.1301 6.2734 7.5212 1.1508 3.6501 5.8309 3.9894 7.1680 5.5213 5.0717 9.5119 3.1106 1.6287 7.5915 7.6333 1.5027 8.6572 6.0631 2.6772 5.6932 1.6369 3.0620 1.6492 2.5385 3.2074 3.4076 2.9826 4.8334 4.2989 1.7039 2.1117 3.5142 1.0557 1.0490 5.6517 5.4138 1.8688 11.0852 3.0001 11.3643 1.0377 1.0947 1.1026 1.0992 1.0443 1.0825 1.1058
irintensity: 0.0441 0.3339 3.8026 13.6118 0.1636 1.3926 6.9681 3.4696 6.0865 0.8868 7.4761 12.8742 2.4901 151.3718 11.1734 0.7415 133.2378 4.3661 5.2900 14.1120 25.8893 6.0267 4.8390 16.0554 129.5500 54.9361 88.8676 6.4711 19.5927 11.1621 49.1862 37.6657 56.7916 9.3598 11.6718 26.2074 167.1838 53.1352 29.3962 15.1105 48.0113 33.8465 24.2398 196.3762 50.0129 23.0993 22.3050 129.4213 85.2417 2.6062 609.4074 456.0895 149.7995 0.2013 4.2170 4.3892 1.6439 112.7937 91.4431 60.6794
temp: 298.150 k
press: 1.00000 atm
elementType: 8 8 8 7 7 7 7 7 6 6 6 6 6 6 6 1 1 1 1 1 1 1
symmnumber: 1
zpe: 399636.8 jmol-1
zpe.correction: 0.152214 hartree
zpe.thermalcorrener: 0.165679 hartree
zpe.thermalcorrenthalpy: 0.166623 hartree
zpe.thermalcorrgfe: 0.111236 hartree
zpe.sumelectzpe: -769.259893 hartree
zpe.sumelectthermal: -769.246428 hartree
zpe.sumelectthermalent: -769.245483 hartree
zpe.sumelectthermalfe: -769.300871 hartree
dipole: 5.9197 -2.0349 -2.0144
dipole: 6.5758
quadrupole: -81.2089 -71.3025 -92.2941
quadrupole: 22.2133 -0.3396 -3.0507
quadrupole: 0.3930 10.2994 -10.6923 22.2133 -0.3396 -3.0507
hfenergy: -769.4121065 hartree
pointgroup: C01 [X(C7H7N5O3)]
dipole: 2.2539206 -1.024435 -0.7506916 debye
dipolederiv: -0.8913368 0.2414466 -0.2024742 0.4297415 -0.450091 0.1835616 -0.5172508 0.2152286 -0.510383 -1.3634704 0.230397 0.1695407 0.1386522 -0.5629309 -0.0313982 0.2070485 -0.0555779 -0.4215697 -0.4603953 0.0453048 0.2175653 0.1591958 -0.2925881 0.0248892 -0.3015522 0.1444779 -0.8693009 -0.0467772 0.0474469 0.0577534 -0.3191554 -0.6819862 0.0700824 0.0726998 -0.0334918 -0.1015754 -0.5862053 -0.0653201 0.0510083 -0.0690604 -0.153755 0.0047504 0.0860716 0.0129211 -0.2087166 -0.4236002 -0.0387744 0.0409312 -0.254062 -0.4319858 0.0006375 0.0245751 -0.008017 -0.2373209 -1.6291603 -0.3659524 0.185623 -0.2021879 -0.7016812 0.0697794 0.2652318 0.0830007 -0.3505727 -0.8452773 -0.7025042 -0.0071148 -0.5629614 -1.0066726 0.1548871 -0.0318404 0.1341425 -0.6837194 0.4176648 0.1635562 -0.0442291 0.5774774 0.5009635 0.0135218 -0.0445381 -0.0051264 0.0882395 -0.1942305 0.2870619 0.027423 0.4961842 -0.440991 -0.1090583 0.0264707 -0.0765236 -0.0107406 1.5832478 0.4894157 -0.2427297 -0.0028015 1.6232112 -0.1158559 -0.2607139 -0.0886476 0.3138445 1.9636223 -0.1429755 -0.2999936 0.0645352 1.2164148 0.0266453 -0.3599424 0.0677552 0.3094702 0.5843893 -0.0045637 -0.1320089 -0.0360359 -0.0025945 0.0071437 -0.1406469 -0.0052678 -0.0475334 1.2762314 -0.3693491 0.0019324 -0.6899894 0.4751474 -0.2139262 0.8401672 -0.3752238 1.3656033 -0.3326728 0.1422367 0.0808774 0.2893953 -0.1019627 -0.072444 0.049419 -0.029196 -0.0758105 0.2669737 0.0204459 0.0211033 0.0659425 0.2344212 -0.0156225 0.0227411 -0.0064961 0.3478313 0.0920087 -0.0313662 0.0167807 -0.044866 0.0268057 0.0021962 0.0182299 0.0050651 0.190201 0.2183761 0.0642398 0.0382745 0.0030762 0.2214672 -0.0447435 0.0532645 -0.0180227 0.3594509 0.1778461 0.0134484 0.0478596 0.0492352 0.3201775 -0.0161881 0.051487 0.0025766 0.3770221 0.1146184 -0.0017011 0.0290934 -0.0648632 0.0665753 0.1017038 0.0309595 0.0863334 0.0296204 -0.004128 0.0208183 -0.053441 0.0006825 0.1331468 -0.0013828 -0.0860264 -0.0114652 0.0056209 0.0822752 -0.0433116 -0.0037749 -0.0281349 0.0089086 -0.0391788 -0.0058545 -0.0384454 0.1303389 unknown
polarizability: 163.3470104|-2.3774999|137.5267852|-11.3827103|-1.4431398|66.8648698 unknown
InChI: InChI=1S/C7H7N5O3/c1-3(13)15-12-5-4(9-2-10-5)6(14)11-7(12)8/h2,9H,8H2,1H3
charge 0 multiplicity 1
22 atoms
O  1.959502 0.157718 -0.707206
O  -3.394202 1.287457 0.436663
O  2.204674 -0.420872 1.584997
N  0.569979 0.421449 -0.415574
N  -2.275883 -1.591894 0.106762
N  -0.080301 -1.998239 -0.352488
N  -1.185796 2.020687 -0.011441
N  1.011978 2.741391 -0.440242
C  -0.321913 -0.636946 -0.26671
C  -1.663146 -0.337578 0.014296
C  0.089291 1.737499 -0.273845
C  -2.182093 1.023357 0.171135
C  -1.301292 -2.550493 -0.117299
C  2.693088 -0.386842 0.456305
C  4.025887 -0.871232 -0.045505
H  -3.266091 -1.732813 0.308895
H  -1.497168 -3.619158 -0.103125
H  1.970394 2.546182 -0.716775
H  0.673833 3.694598 -0.33831
H  4.380233 -0.269184 -0.896618
H  4.760068 -0.856277 0.773811
H  3.907857 -1.912907 -0.396026
