program: Gaussian 09
title: 000188119
version: EM64L-G09RevD.01
frameworkgroup: C1[X(C6H11Cl4O4P)]
method: RPBEPBE
basis: SDD
operation: Freq
keyword: #p
keyword: freq=noraman
keyword: PBEPBE/SDD
title: #p freq=noraman PBEPBE/SDD
converged: NO YES NO NO
title: Mulliken charges:
elementType: Cl Cl Cl Cl P O O O O C C C C C C H H H H H H H H H H H
charge: -0.064598 -0.048668 -0.040650 -0.043038 1.424423 -0.527999 -0.537611 -0.648037 -0.595803 0.046763 0.088196 -0.585024 -0.587958 -0.600355 -0.603535 0.268643 0.283121 0.329059 0.292819 0.292322 0.294581 0.305157 0.275663 0.268551 0.299627 0.414351
chargesum: 0.00000
title: Mulliken charges with hydrogens summed into heavy atoms:
elementType: Cl Cl Cl Cl P O O O O C C C C C C
charge: -0.064598 -0.048668 -0.040650 -0.043038 1.424423 -0.527999 -0.537611 -0.233686 -0.595803 0.315406 0.371317 0.036854 -0.001054 -0.019536 -0.035357
polarizability: 1.65099499e+02 3.14366468e+00 1.24515662e+02 -7.48404361e-02 1.05018797e+00 1.17848803e+02
1716.lowfreq: -9.6942 -4.7878 -0.0025 -0.0018 -0.0013 6.7080 17.6538 20.4673 32.4795
frequency: 17.1170 20.3105 32.4226 41.5864 60.0813 61.9107 72.6930 107.2445 113.8493 127.3376 146.5520 175.4779 199.6391 211.3646 218.8053 238.0570 239.0395 287.6266 307.5790 322.5226 352.2213 388.3805 440.7559 469.6126 521.3880 537.2554 598.6164 627.8480 654.6214 675.1553 729.5029 742.4499 760.5144 833.0531 866.5942 875.4135 893.0163 940.9962 944.6004 976.6894 1005.7436 1014.5679 1078.4190 1097.9547 1110.7837 1126.6250 1176.6445 1198.8716 1207.3895 1238.5355 1259.4756 1282.2327 1292.9703 1311.5410 1323.3211 1344.3941 1348.8199 1430.0652 1435.0209 1441.6413 1447.6494 2997.1751 2997.7256 3056.1557 3067.7427 3072.7714 3082.2473 3137.7757 3155.4683 3162.8435 3172.7738 3566.9209
redmass: 14.3784 14.6938 12.9092 13.2133 9.6620 15.8819 9.2281 3.9410 8.7407 7.1150 6.1939 3.4301 5.1174 3.4382 4.3067 3.5317 10.1575 3.2036 2.0131 5.4226 3.3944 7.2393 4.1200 4.1081 5.0887 6.0957 7.9263 6.8024 4.9069 5.5086 5.7711 4.8159 7.3398 3.0893 2.7426 2.2507 2.2873 2.0176 2.0064 1.7900 1.8894 2.6751 1.5358 2.6987 1.9748 1.0832 1.1723 1.4064 1.3223 1.2469 1.1553 1.2199 1.3504 1.2266 1.2169 1.4077 1.4696 1.0916 1.0845 1.0991 1.0930 1.0841 1.0843 1.0580 1.0573 1.0579 1.0564 1.1103 1.1109 1.1089 1.1121 1.0659
irintensity: 0.7125 0.3805 0.9911 2.4081 2.6744 2.2813 1.3890 6.7250 10.0561 1.5444 4.6161 7.2372 1.1968 4.1966 55.5015 11.5883 3.7607 4.9952 45.8019 34.2465 7.5428 73.2537 12.8683 6.3371 19.6365 40.5157 27.8180 41.9750 16.9999 37.5291 111.7830 37.7923 197.6906 162.8561 136.7215 104.9534 17.5768 91.1230 24.1712 70.0596 62.3368 75.1347 2.0205 72.6016 43.3511 5.2461 27.3351 2.7513 9.6028 0.9038 7.6700 16.0982 7.9979 13.5124 23.3005 0.4135 4.6029 12.3356 31.3272 22.8664 14.3660 5.7200 10.9028 7.7181 6.3517 7.6169 5.9985 2.9161 0.6465 2.7400 1.6472 89.8479
temp: 298.150 k
press: 1.00000 atm
elementType: 17 17 17 17 15 8 8 8 8 6 6 6 6 6 6 1 1 1 1 1 1 1 1 1 1 1
symmnumber: 1
zpe: 463386.5 jmol-1
zpe.correction: 0.176495 hartree
zpe.thermalcorrener: 0.195682 hartree
zpe.thermalcorrenthalpy: 0.196626 hartree
zpe.thermalcorrgfe: 0.124185 hartree
zpe.sumelectzpe: -2716.379794 hartree
zpe.sumelectthermal: -2716.360606 hartree
zpe.sumelectthermalent: -2716.359662 hartree
zpe.sumelectthermalfe: -2716.432103 hartree
dipole: 0.3517 1.5075 -1.1201
dipole: 1.9107
quadrupole: -131.2354 -133.8138 -125.3639
quadrupole: -5.4789 5.1008 7.7577
quadrupole: -1.0977 -3.6761 4.7738 -5.4789 5.1008 7.7577
hfenergy: -2716.5562885 hartree
pointgroup: C01 [X(C6H11Cl4O4P1)]
dipole: -0.0910351 0.5247828 0.5305042 debye
dipolederiv: -0.3219553 0.0171999 -0.1366268 -0.0137145 -0.1895002 -0.0081674 -0.1095848 0.0691133 -0.4425784 -0.5962224 0.053738 0.1004086 -0.0087609 -0.1898991 0.0005838 0.0814436 -0.0167857 -0.1773294 -0.4542262 0.1488692 0.0418962 0.1207044 -0.2726223 -0.0076386 0.0968827 -0.0432781 -0.1603844 -0.1919089 0.080975 -0.0049021 -0.0030254 -0.5279675 -0.0151578 -0.0116094 0.0059607 -0.1475737 2.4986783 0.082631 0.0106159 -0.105806 1.5585632 0.0373083 -0.3581792 -0.1656622 2.1287233 -1.5979841 0.0153962 0.4578144 0.2189587 -0.5506323 -0.0369726 0.5382901 0.0073726 -0.6961342 -1.033909 -0.0133043 -0.4281333 -0.0994664 -0.5472288 -0.0995275 -0.6141921 0.0195199 -1.1013994 -0.655051 0.0197912 0.1900734 0.0234443 -0.6845391 0.4015298 0.1812385 0.2232533 -0.9203359 -0.7589017 -0.0540952 0.0378322 0.0517992 -0.6228213 -0.0656282 0.0508482 -0.031034 -0.6686778 0.9079273 -0.023595 -0.3760417 0.1073637 0.2241739 -0.207825 -0.233082 -0.0365347 0.2142004 0.177386 0.147343 0.1758266 -0.126297 0.1562388 -0.0878234 0.7341969 0.0453198 0.7475263 0.0902004 0.0335508 0.2947062 -0.0095237 -0.0240297 0.0467978 0.3017018 -0.0071973 0.5097786 0.6944689 0.0104173 -0.0592031 0.0383342 0.1002084 -0.0006915 -0.0993947 0.0115795 0.1497584 0.6246636 -0.3010962 -0.1377015 -0.2103041 0.1029829 0.0853191 -0.2746294 0.0072728 0.0962587 0.1158692 -0.1650938 -0.0454855 -0.0638627 0.6949716 0.0399561 -0.0820213 -0.0008151 0.0726938 -0.0101167 -0.024297 0.0059197 -0.0390131 0.034905 0.0400692 -0.0621449 -0.0212957 -0.0545964 0.0768805 0.0304008 0.0532041 0.1147831 0.0473891 0.0064188 -0.0722645 0.0117389 -0.0043221 0.1060865 0.091192 -0.0802931 0.0662361 0.0617108 -0.0262855 -0.0822534 -0.0559734 0.0207447 -0.0266421 -0.0788627 -0.0039662 -0.0529597 0.1504346 0.0083565 -0.0051808 0.007639 0.0035535 -0.0192787 -0.0503829 -0.0503694 -0.0216828 0.113701 -0.0072726 0.00183 -0.0527106 0.0046264 -0.0012468 -0.0294258 0.0178155 -0.0060286 0.0052327 0.0707481 0.0134849 0.0831464 0.0522933 -0.0533636 -0.0133624 0.0059262 -0.0290947 0.0097789 -0.0438972 0.016065 -0.0628223 0.0884481 -0.0104451 0.0588277 0.0208092 0.0765438 0.0962392 -0.0067951 0.0218615 0.0117984 -0.0778335 0.0605911 0.0238722 -0.0471021 0.0099724 -0.0209669 0.0257712 -0.0777748 0.0274638 -0.0452051 0.0605255 0.0218551 0.0534608 0.0539946 -0.0055014 -0.0228899 0.0871648 0.0108726 0.0632846 0.3179742 -0.0825442 -0.0964841 -0.0925947 0.2791787 -0.1262864 -0.0426968 -0.047942 0.3444805 unknown
polarizability: 164.4333403|-5.8521284|125.2979749|-1.5587762|0.2004437|117.7326484 unknown
InChI: InChI=1S/C6H11Cl4O4P/c7-1-5(2-8)13-15(11,12)14-6(3-9)4-10/h5-6,11H,1-4H2
charge 0 multiplicity 1
26 atoms
Cl -1.586113 -1.06742 2.218687
Cl -5.027078 0.729568 0.53971
Cl 3.775934 -1.981109 0.35097
Cl 2.220383 2.749661 0.882424
P  0.022548 -0.395375 -1.517752
O  -1.122239 0.47171 -0.535115
O  1.492166 0.147517 -0.808059
O  0.15754 0.442914 -2.992692
O  -0.305844 -1.937668 -1.668771
C  -2.485237 -0.073701 -0.284316
C  1.743395 -0.007259 0.650954
C  -2.467654 -1.345159 0.56812
C  -3.200154 1.13231 0.334691
C  2.092815 -1.455622 1.013153
C  2.855568 0.984068 0.97521
H  -2.960091 -0.341199 -1.251198
H  0.814151 0.252342 1.198706
H  -1.917643 -2.153264 0.066146
H  -3.493152 -1.647167 0.826929
H  -2.811508 1.364766 1.335439
H  -3.14419 2.002437 -0.332011
H  1.367269 -2.163576 0.585303
H  2.147109 -1.57696 2.1059
H  3.223361 0.842163 2.002324
H  3.677951 0.909152 0.251719
H  0.761612 1.230573 -2.960171
