program: Gaussian 09
title: 000188107
version: EM64L-G09RevD.01
frameworkgroup: C1[X(C12H12FN3OS)]
method: RPBEPBE
basis: SDD
operation: Freq
keyword: #p
keyword: freq=noraman
keyword: PBEPBE/SDD
title: #p freq=noraman PBEPBE/SDD
converged: NO YES NO NO
title: Mulliken charges:
elementType: S F O N N N C C C C C C C C C C C C H H H H H H H H H H H H
charge: 0.047070 -0.206539 -0.232310 -0.019897 -0.124505 -0.309494 -0.354140 -0.354844 -0.404324 -0.405709 -0.272573 0.224320 0.530017 -0.494995 -0.368330 0.349649 -0.170374 -0.392508 0.237842 0.264110 0.232169 0.260506 0.230410 0.217682 0.228988 0.219082 0.295637 0.279334 0.235294 0.258428
chargesum: 0.00000
title: Mulliken charges with hydrogens summed into heavy atoms:
elementType: S F O N N N C C C C C C C C C C C C
charge: 0.047070 -0.206539 -0.232310 -0.019897 -0.124505 -0.309494 0.147812 0.137831 0.043769 0.042362 -0.272573 0.224320 0.530017 -0.199358 -0.088995 0.349649 0.064920 -0.134080
polarizability: 2.33935387e+02 5.88981717e+00 1.78637230e+02 4.35367909e+00 4.80312463e+00 9.78139063e+01
1716.lowfreq: -6.1817 -0.0017 -0.0013 0.0015 5.6166 10.3259 38.7958 41.0832 82.3436
frequency: 38.7725 41.0257 82.3371 87.1563 109.2486 149.2527 195.7749 215.6335 235.1527 244.2949 263.9287 280.5038 302.7492 331.6893 350.5717 422.8357 443.6110 451.2861 466.8487 503.4228 507.9652 571.1153 593.8563 602.2089 641.6637 670.3176 694.6334 703.5250 754.1871 784.3090 823.2273 839.8152 855.0886 874.1882 891.8682 897.9289 911.7589 965.7310 968.9240 989.2148 992.1645 1047.2258 1081.7456 1085.0912 1091.8177 1118.5675 1133.7178 1166.7208 1172.8717 1183.8044 1228.0975 1252.8755 1256.9937 1281.7109 1295.0185 1319.9661 1335.2251 1346.7839 1350.9622 1353.9036 1362.2560 1388.3463 1400.8774 1448.6087 1460.4832 1462.4682 1476.3323 1480.9000 1483.9244 1597.5093 1620.5229 1681.6185 2967.0504 2970.2368 3000.5317 3002.9632 3067.6400 3074.0731 3086.7472 3088.3878 3153.1049 3180.9572 3192.3880 3198.5549
redmass: 7.1044 5.0891 5.2196 4.5667 4.1259 7.2191 8.1460 3.4046 3.7473 5.0169 4.8630 4.0177 7.8503 5.5360 2.5126 5.6808 5.5156 3.1745 2.6382 7.4753 5.1083 5.7216 4.0663 8.5172 5.9142 3.1000 2.8984 7.5845 6.0663 1.3964 1.5325 3.6177 2.5183 1.8332 1.4515 3.4387 1.4176 2.1352 1.3856 6.2129 4.6054 2.8656 1.5642 1.9456 2.2860 1.9867 2.2141 1.6703 1.3878 1.5295 3.8287 1.2850 1.4380 2.3215 1.7276 3.1621 1.4793 1.4239 1.6655 3.3543 1.4311 7.8396 5.6173 3.3205 1.0872 1.0923 1.0845 1.0885 2.8223 6.9051 7.0973 12.1865 1.0691 1.0690 1.0647 1.0604 1.0987 1.1004 1.0950 1.0970 1.0884 1.0943 1.0968 1.0939
irintensity: 0.3268 3.8326 2.2364 1.1272 1.1450 1.6906 1.6743 2.1787 3.3491 1.4765 4.8643 8.6423 14.3561 0.1174 23.1289 2.0521 4.3146 7.0591 3.4110 6.1735 0.8861 2.3181 9.7484 19.2556 2.6794 13.2347 16.5645 11.3811 17.4418 44.5907 1.6308 25.7940 5.8570 24.4684 8.6515 42.6258 4.1774 17.4362 1.0999 0.2994 3.5760 11.3010 2.7246 1.9691 46.3744 12.1557 9.8843 9.7518 1.1967 6.9613 202.5872 76.0904 80.6886 123.1691 71.6113 121.9564 14.2296 3.1678 38.2604 132.7273 0.7314 19.9774 136.2145 17.6527 12.3476 12.4032 16.5760 0.6798 113.4768 54.2564 65.5335 377.3040 43.9433 26.9963 23.6791 33.5273 36.7254 31.6549 1.8998 17.2078 8.8614 3.6766 1.0725 2.0319
temp: 298.150 k
press: 1.00000 atm
elementType: 16 9 8 7 7 7 6 6 6 6 6 6 6 6 6 6 6 6 1 1 1 1 1 1 1 1 1 1 1 1
symmnumber: 1
zpe: 596334.6 jmol-1
zpe.correction: 0.227132 hartree
zpe.thermalcorrener: 0.242392 hartree
zpe.thermalcorrenthalpy: 0.243337 hartree
zpe.thermalcorrgfe: 0.183847 hartree
zpe.sumelectzpe: -1200.565364 hartree
zpe.sumelectthermal: -1200.550104 hartree
zpe.sumelectthermalent: -1200.549159 hartree
zpe.sumelectthermalfe: -1200.608649 hartree
dipole: -6.0598 0.1684 1.0753
dipole: 6.1568
quadrupole: -87.4547 -124.9965 -111.4052
quadrupole: 13.1271 4.9414 4.2043
quadrupole: 20.4975 -17.0443 -3.4531 13.1271 4.9414 4.2043
hfenergy: -1200.7924961 hartree
pointgroup: C01 [X(C12H12F1N3O1S1)]
dipole: -2.3786842 0.1091216 0.4442751 debye
polarizability: 234.1216713|5.5395704|178.7895033|2.6809825|1.0436399|97.4753488 unknown
InChI: InChI=1S/C12H12FN3OS/c13-9-4-3-5-10(8-9)16-11(17)14-6-1-2-7-15(14)12(16)18/h3-5,8H,1-2,6-7H2
charge 0 multiplicity 1
30 atoms
S  -0.571409 2.832949 -0.595962
F  4.445347 -1.658067 -1.014213
O  -0.158209 -2.239576 0.484011
N  -2.119323 0.62609 -0.064577
N  -1.988386 -0.789413 0.060704
N  0.052121 0.142389 0.043014
C  -3.383369 1.165693 -0.595857
C  -3.119125 -1.572839 0.588684
C  -4.577052 0.433812 0.052674
C  -4.425352 -1.101447 -0.081988
C  -0.864412 1.206715 -0.181592
C  -0.637383 -1.110051 0.221493
C  1.483697 0.250181 0.094264
C  2.266682 -0.766862 -0.502926
C  2.098295 1.345565 0.74772
C  3.661373 -0.646083 -0.423964
C  3.506197 1.428338 0.789895
C  4.313473 0.42818 0.202725
H  -3.399456 1.041186 -1.698494
H  -3.378547 2.245935 -0.378043
H  -3.18327 -1.4456 1.689552
H  -2.894489 -2.63121 0.378242
H  -5.505997 0.775358 -0.437233
H  -4.644871 0.710939 1.122355
H  -5.277198 -1.618682 0.394061
H  -4.417029 -1.386327 -1.151523
H  1.813741 -1.630867 -0.992662
H  1.482852 2.125231 1.200448
H  3.979605 2.278883 1.290122
H  5.405592 0.471579 0.229574
